displayTitle,firstLine,textAuthNumber,hymnalTitle,hymnalID,number,textTitle,refrainFirstLine,authors,composers,meter,tuneTitle,tuneAuthNumber,incipit,languages,textSources,tuneSources
"All Things Come of Thee","All things come of Thee, O Lord",all_things_come_of_thee_o_lord,"Seventh-day Adventist Hymnal",SDAH1985,665,"All Things Come of Thee",,,Anon.,,"[Chant] (Beethoven 33211)",chant_beethoven_33211,"	33211 23432 111",,"<cite>From </cite>Christ in Song, <cite>1908</cite>",
"At the Presentation of Alms","All things come of thee, O Lord",all_things_come_of_thee_o_lord,"The Hymnal: as authorized and approved by the General Convention of the Protestant Episcopal Church in the United States of America in the year of our Lord 1916",EH1916,C137,"At the Presentation of Alms",,,"Ludwig van Beethoven",,"[All things come of thee, O Lord]",chant_beethoven_33211,3321123432111,,,
"All things come of Thee, O Lord","All things come of Thee, O Lord",all_things_come_of_thee_o_lord,"The Hymnal",HPAG1933,R26,,,,"Ludwig van Beethoven (1770-1827)",,"[All things come of Thee, O Lord]",chant_beethoven_33211,3321123432111,,,
"All things come of Thee, O Lord","All things come of Thee, O Lord",all_things_come_of_thee_o_lord,"The Beacon Hymnal: for Church Schools, Young People's Services, Day Schools, and the Home",BH1924,S13,,,,"Ludwig van Beethoven",,"[All things come of Thee, O Lord]",chant_beethoven_33211,3321123432111,English,,
"All things come of thee, O Lord","All things come of thee, O Lord",all_things_come_of_thee_o_lord,"At Worship: a hymnal for young churchmen",AW41951,R5,,,,"Ludwig van Beethoven",,"[All things come of thee, O Lord]",chant_beethoven_33211,3321123432111,English,,
"All Things Come of Thee","All things come of Thee, O Lord",all_things_come_of_thee_o_lord,"Great Songs of the Church: number two: a treasury of six hundred sacred songs suitable for all services of the church",GSoC1975,8,"All Things Come of Thee",,,Beethoven,,"[All things come of Thee]",chant_beethoven_33211,3321123432111,English,"I Chronicles 29:14",
"All Things Come of Thee","All things come of Thee, O Lord; and of Thine own have we given Thee",all_things_come_of_thee_o_lord,"Mount Hermon Melodies, book two",MHM21944,28,"All Things Come of Thee",,,Beethoven,,"[All things come of Thee, O Lord; and of Thine own have we given Thee]",chant_beethoven_33211,3321123432111,English,,
"All Things Come Of Thee","All things come of thee, O Lord",all_things_come_of_thee_o_lord,"Youth Sings",YS1951,57,"All Things Come Of Thee",,,Beethoven,,"[All things come of thee, O Lord]",chant_beethoven_33211,3321123432111,English,,
"All things come of thee, O Lord","All things come of thee, O Lord",all_things_come_of_thee_o_lord,"New Worship and Song: with Worship Services and Source Materials",NWSW1942,128,,,,Beethoven,,"[All things come of thee, O Lord]",chant_beethoven_33211,3321123432111,English,,
"All Things Come of Thee, O Lord","All things come of Thee, O Lord",all_things_come_of_thee_o_lord,"Hymns for Junior Worship",H4JW1940,129,"All Things Come of Thee, O Lord",,,"Ludwig van Beethoven (1770-1827)",,"[All things come of Thee, O Lord]",chant_beethoven_33211,3321123432111,English,,
"All Things Come of Thee, O Lord","All things come of thee, O Lord",all_things_come_of_thee_o_lord,"The Hymnal for Boys and Girls",H4BG1935,153,"All Things Come of Thee, O Lord",,,"Ludwig van Beethoven",Irregular,OFFERTORY,chant_beethoven_33211,3321123432111,,,
"All things come of Thee, O Lord","All things come of Thee, O Lord",all_things_come_of_thee_o_lord,"The Book of Worship of the Church School",BWCS1915,157c,,,,Beethoven,,"[All things come of Thee, O Lord]",chant_beethoven_33211,3321123432111,English,,
"All things come of Thee, O Lord","All things come of Thee, O Lord",all_things_come_of_thee_o_lord,"Junior Church School Hymnal: for use in the junior section of the church school, in the home, and in junior congragations (Teacher's Edition)",JCSH1927,184,,,,Beethoven,,"[All things come of Thee, O Lord]",chant_beethoven_33211,3321123432111,English,,
"All Things Come of Thee, O Lord","All things come of Thee, O Lord",all_things_come_of_thee_o_lord,"Hymns for Creative Living",H4CL1935,194,"All Things Come of Thee, O Lord",,,Beethoven,,"[All things come of Thee, O Lord]",chant_beethoven_33211,3321123432111,English,,
"Todo viene de ti, oh, Dios","Todo viene de ti, oh, Dios",todo_viene_de_ti_oh_dios,"Toda La Iglesia Canta",TLIC1989,208,,,,"Ludwig vn Beethoven (1770-1827)",,"TODO VIENE DE TI",chant_beethoven_33211,3321123432111,Spanish,,
"All Things Come of Thee","All things come of Thee, O Lord",all_things_come_of_thee_o_lord,"Youth Hymnal",YH1935,222,"All Things Come of Thee",,,Beethoven,,"[All things come of Thee, O Lord]",chant_beethoven_33211,3321123432111,English,,
"All things come of Thee, O Lord","All things come of Thee, O Lord",all_things_come_of_thee_o_lord,"The School Hymnal: a book of worship for young people",SH1920,294,,,,Beethoven,,"[All things come of Thee, O Lord]",chant_beethoven_33211,3321123432111,English,,
"All Things Come of Thee","All things come of Thee, O Lord",all_things_come_of_thee_o_lord,"The Abingdon Song Book",ASB1938,301,"All Things Come of Thee",,,Beethoven,,"[All things come of Thee, O Lord]",chant_beethoven_33211,3321123432111,English,,
"All things come of Thee, O Lord; and of Thine own have we given Thee","All things come of Thee, O Lord; and of Thine own have we given Thee",all_things_come_of_thee_o_lord,"The Hymnal for Young People",H4YP1928,307,,,,Beethoven,,"[All things come of Thee, O Lord; and of Thine own have we given Thee]",chant_beethoven_33211,3321123432111,English,,
"All things come of Thee, O Lord","All things come of Thee, O Lord",all_things_come_of_thee_o_lord,"Voice of Praise",VoP1947,309,,,,Beethoven,,[Amen],chant_beethoven_33211,3321123432111,,,
"All Things Come Of Thee","All things come of Thee, O Lord",all_things_come_of_thee_o_lord,"Christian Service Songs",CSS1939,310,"All Things Come Of Thee",,,Beethoven,,"[All things come of Thee, O Lord] ",chant_beethoven_33211,3321123432111,English,,
"All things come of Thee, O Lord","All things come of Thee, O Lord",all_things_come_of_thee_o_lord,"The Hymnal for Youth",THfY1941,314,,,,"Ludwig van Beethoven",,"[All things come of Thee, O Lord]",chant_beethoven_33211,3321123432111,English,,
"All Things Come of Thee","All things come of Thee, O Lord",all_things_come_of_thee_o_lord,"The New National Baptist Hymnal (21st Century Edition)",NNBH2001,356,"All Things Come of Thee",,,"Ludwig van Beethoven",,"[All things come of Thee, O Lord]",chant_beethoven_33211,3321123432111,English,,
"All Things Come of Thee, O Lord","All things comes of Thee, O Lord",all_things_come_of_thee_o_lord,"The Church School Hymnal for Youth",CSHY1928,366,"All Things Come of Thee, O Lord",,,Beethoven,,"[All things comes to Thee, O Lord]",chant_beethoven_33211,3321123432111,English,,
"All things come of Thee, O Lord","All things come of Thee, O Lord",all_things_come_of_thee_o_lord,"American Church and Church School Hymnal: a new religious educational hymnal",ACCS1927,376,,,,Beethoven,,OFFERING,chant_beethoven_33211,3321123432111,English,,
"Todo es de Ti II","Todo es de Ti, Señor",todo_es_de_ti_senor,"Himnario Metodista: Preparado y editado bajo la dirección del Comité del Himnario de la Conferencia Río Grande de La Iglesia Metodista Unida",HM1973,381,"Todo es de Ti II",,"Anita Gonzalez","Ludwig van Beethoven, 1770-1827",,"[Todo es de Ti, Señor]",chant_beethoven_33211,3321123432111,Spanish,,
"All Things Come of Thee","All things come of thee, O Lord",all_things_come_of_thee_o_lord,"Hymnbook for Christian Worship",H4CW1970,399,"All Things Come of Thee",,,"Ludwig van Beethoven, 1770-1827",,"[All things come of Thee, O Lord]",chant_beethoven_33211,3321123432111,English,,
"Lord, have mercy upon us, and incline our hearts to keep this law","Lord, have mercy upon us, and incline our hearts to keep this law",lord_have_mercy_upon_us_and_incline_our_,"New Baptist Hymnal: containing standard and Gospel hymns and responsive readings",NBH1926,421,,,,Beethoven,,"[Lord, have mercy upon us, and incline our hearts to keep this law]",chant_beethoven_33211,3321123432111,English,,
"All things come of thee, O Lord","All things come of thee, O Lord",all_things_come_of_thee_o_lord,"New Baptist Hymnal: containing standard and Gospel hymns and responsive readings",NBH1926,422a,,,,Beethoven,,"[All things come of thee, O Lord]",chant_beethoven_33211,3321123432111,English,,
"All things come of Thee, O Lord","All things come of Thee, O Lord",all_things_come_of_thee_o_lord,"Christian Song",CS1926,424,,,,Beethoven,,"[All things come of Thee, O Lord]",chant_beethoven_33211,3321123432111,English,,
"Todo de Ti Viene, Oh Dios","Todo de Ti viene, oh Dios",todo_de_ti_viene_oh_dios,"El Himnario",EH1964,428,"Todo de Ti Viene, Oh Dios",,,"Ludwig Van Beethoven",,"[Todo de Ti viene, oh Dios]",chant_beethoven_33211,3321123432111,Spanish,,
"All Things Come of Thee","All things come of Thee, O Lord",all_things_come_of_thee_o_lord,"Church Service Hymns",CSH1948,439,"All Things Come of Thee",,,Beethoven,,"[All things come of Thee, O Lord]",chant_beethoven_33211,3321123432111,English,,
"All things come of Thee, O Lord, and of Thine own have we given Thee","All things come of Thee, O Lord, and of Thine own have we given Thee",all_things_come_of_thee_o_lord,"Hymns of the Kingdom of God",HoKo1923,457,,,,"Beethoven, 1770-1827",,"[All things come of Thee, O Lord, and of Thine own have we given Thee]",chant_beethoven_33211,3321123432111,English,,
"All things come of Thee, O Lord, and of Thine own have we given Thee","All things come of Thee, O Lord, and of Thine own have we given Thee",all_things_come_of_thee_o_lord,"Hymns of the Kingdom of God",HoKo1926,457,,,,"Beethoven, 1770-1827",,"[All things come of Thee, O Lord, and of Thine own have we given Thee]",chant_beethoven_33211,3321123432111,English,,
"All Things Come of Thee","All things come of Thee, O Lord",all_things_come_of_thee_o_lord,"Christian Praise",CP1964,459,"All Things Come of Thee",,,"Ludwig van Beethoven",,"[All things come of Thee, O Lord]",chant_beethoven_33211,3321123432111,English,,
"Todo Viene de Ti, Señor","Todo viene de ti, oh Dios",todo_viene_de_ti_oh_dios,"Cántico Nuevo: Himnario Evangelico",CNHE1962,463,"Todo Viene de Ti, Señor",,,"Ludwig van Beethoven, 1770-1827",,"[Todo viene de ti, oh Dios]",chant_beethoven_33211,3321123432111,Spanish,,
"All Things Come of Thee","All things come of Thee, O Lord",all_things_come_of_thee_o_lord,"The Hymnal of The Evangelical United Brethren Church",HEUB1957,467,"All Things Come of Thee",,,"Ludwig van Beethoven, d. 1827",,"[All things come of Thee, O Lord]",chant_beethoven_33211,3321123432111,,,
"All Things Come of Thee, O Lord","All things come of Thee, O Lord",all_things_come_of_thee_o_lord,"The Broadman Hymnal",BH1940,491,"All Things Come of Thee, O Lord",,,Beethoven,,"[All things come of Thee, O Lord]",chant_beethoven_33211,3321123432111,English,,
"All things come of Thee, O Lord: and of Thine own have we given Thee","All things come of Thee, O Lord: and of Thine own have we given Thee",all_things_come_of_thee_o_lord,"The Hymnal: Containing Complete Orders of Worship. Authorized by the General Synod of the Evangelical and Reformed Church",HAGS1941,505,,,,"Ludwig van Beethoven",,"[Hear, O Lord, our humble supplication]",chant_beethoven_33211,3321123432111,English,,
"All Things Come of Thee","All things come of Thee, O Lord",all_things_come_of_thee_o_lord,"Revival Hymns and Choruses",RHC,519,"All Things Come of Thee",,,"Ludwig van Beethoven, 1770-1827",,"[All things come of Thee, O Lord]",chant_beethoven_33211,3321123432111,English,,
"All things come of thee, O Lord, and of thine own","All things come of thee, O Lord, and of thine own",all_things_come_of_thee_o_lord,"Hymns for the Living Age",H4LA1923,526,,,,Beethoven,,OFFERINGS,chant_beethoven_33211,3321123432111,English,,
"All things come of Thee, O Lord","All things come of Thee, O Lord",all_things_come_of_thee_o_lord,"Hymns of the Christian Life",HoCL1925,527,,,,Beethoven,,"[All things come of Thee, O Lord]",chant_beethoven_33211,3321123432111,English,,
"All Things Come of Thee, O Lord","All things come of thee, O Lord",all_things_come_of_thee_o_lord,"Pilgrim Hymnal",PH1958,536,"All Things Come of Thee, O Lord",,,"Ludwig Van Beethoven, 1770-1827",,"[All things come of thee, O Lord]",chant_beethoven_33211,3321123432111,English,,
"All Things Come of Thee","All things come of Thee, O Lord",all_things_come_of_thee_o_lord,"The New National Baptist Hymnal",NNBH1977,536,"All Things Come of Thee",,,"Ludwig van Beethoven",,"[All things come of Thee, O Lord]",chant_beethoven_33211,3321123432111,English,,
"All Things Come of Thee","All things come of Thee, O Lord",all_things_come_of_thee_o_lord,"Great Hymns of the Faith",GHF1968,537,"All Things Come of Thee",,,"Ludwig van Beethoven, 1770-1827",,"[All things come of Thee, O Lord]",chant_beethoven_33211,3321123432111,English,,
"All Things Come of Thee, O Lord","All things come of Thee, O Lord",all_things_come_of_thee_o_lord,"Worship and Service Hymnal: For Church, School, and Home",WASH1957,538,"All Things Come of Thee, O Lord",,,"Ludwig van Beethoven, 1770-1827",,"[All things come of Thee, O Lord]",chant_beethoven_33211,3321123432111,English,,
"All things come of thee, O Lord","All things come of thee, O Lord",all_things_come_of_thee_o_lord,"Services for Congregational Worship. The New Hymn and Tune Book",SCWI1914,547,,,,"Ludwig van Beethoven",,"ALL THINGS COME OF THEE, O LORD",chant_beethoven_33211,3321123432111,English,,
"All things come of thee, O Lord","All things come of thee, O Lord",all_things_come_of_thee_o_lord,"The Hymnal",H1956,554,,,,"Ludwig van Beethoven, 1770-1827",,"ALL THINGS COME OF THEE",chant_beethoven_33211,3321123432111,,,
"All Things Come of Thee, O Lord","All things come of Thee, O Lord",all_things_come_of_thee_o_lord,"The Hymnbook",H1955,556,"All Things Come of Thee, O Lord",,,"Ludwig van Beethoven, (1770-1827) (ascribed to)",,"[All things come of Thee, O Lord]",chant_beethoven_33211,3321123432111,,,
"All Things Come of Thee","All things come of Thee, O Lord",all_things_come_of_thee_o_lord,"A. M. E. C. Hymnal",AMEC1954,558,"All Things Come of Thee",,,"Ludwig van Beethoven, 1770-1827",,"PRESENTATION OF THE OFFERING FOR THE NEEDY",chant_beethoven_33211,3321123432111,English,,
"All things come of Thee, O Lord","All things come of Thee, O Lord",all_things_come_of_thee_o_lord,"Hymns of Worship and Service: (12th ed.)",HoWS1909,573,,,,Beethoven,,"[All things come of Thee, O Lord]",chant_beethoven_33211,3321123432111,English,,
"Lord have mercy upon us, and incline our hearts to keep this law","Lord have mercy upon us, and incline our hearts to keep this law",lord_have_mercy_upon_us_and_incline_our_,"Hymns of Worship and Service: (12th ed.)",HoWS1909,575,,,,Beethoven,,"[Lord have mercy upon us, and incline our hearts to keep this law]",chant_beethoven_33211,3321123432111,English,,
Offertory,"All things come of thee, O Lord",all_things_come_of_thee_o_lord,"Hymns of the Church: new and old",HCNO1912,593,Offertory,,,Beethoven,,"[All things come of thee, O Lord]",chant_beethoven_33211,3321123432111,English,,
"All Things Come of Thee, O Lord","All things come of Thee, O Lord",all_things_come_of_thee_o_lord,"Hymnal and Liturgies of the Moravian Church",HLMC1969,608,"All Things Come of Thee, O Lord",,,Beethoven,,"[All things come of Thee, O Lord]",chant_beethoven_33211,3321123432111,English,,
"All things come of Thee, O Lord","All things come of Thee, O Lord",all_things_come_of_thee_and_of_thine_own,"Christian Worship: a hymnal",CW1941,634,,,,"Ludwig van Beethoven, 1770-1827 Arr. From",,"[All things come of Thee, O Lord]",chant_beethoven_33211,3321123432111,English,,
"All Things Come of Thee","All things come of Thee, O Lord",all_things_come_of_thee_o_lord,"African Methodist Episcopal Church Hymnal",AMEC1984,644,"All Things Come of Thee",,,"Ludwig van Beethoven, 1770-1827",,"[All things come of Thee, O Lord]",chant_beethoven_33211,3321123432111,English,,
"All Things Come of Thee","All things come of Thee, O Lord",all_things_come_of_thee_o_lord,"Total Praise: songs and other worship resources for every generation",ToPr2011,651,"All Things Come of Thee",,,"Ludwig van Beethoven, 1770-1827",,"[All things come of Thee, O Lord]",chant_beethoven_33211,33333211111234321,English,,
"All Things Come of Thee","All things come of Thee, O Lord",all_things_come_of_thee_o_lord,"African American Heritage Hymnal",AAHH2001,668,"All Things Come of Thee",,,"Ludwig van Beethoven, 1770-1827",,"[All things come of Thee, O Lord]",chant_beethoven_33211,3321123432111,English,,
"All Things Come of Thee","All things come of Thee, O Lord",all_things_come_of_thee_o_lord,"One Lord, One Faith, One Baptism: an African American ecumenical hymnal",OLOF2018,668,"All Things Come of Thee",,,"Ludwig van Beethoven, 1770-1827",,"[All things come of Thee, O Lord]",chant_beethoven_33211,33333212111234321,English,,
Offertory,"All things come of Thee, O Lord",all_things_come_of_thee_o_lord,"The Hymnal and Order of Service",HOoS1926,676,Offertory,,,"Ludwig van Beethoven, (1770-1827)",,"[All things come of Thee, O Lord]",chant_beethoven_33211,3321123432111,English,,
"All Things Come Of Thee","All things come of Thee, O Lord",all_things_come_of_thee_o_lord,"The A.M.E. Zion Hymnal: official hymnal of the African Methodist Episcopal Zion Church",AMEZ1996,706,"All Things Come Of Thee",,,"Ludwig van Beethoven, 1770-1827",,"[All things come of Thee, O Lord]",chant_beethoven_33211,3321123432111,English,,
Responses,"All things come of Thee, O Lord",all_things_come_of_thee_o_lord,"The Hymnary for use in Baptist churches",H4B1936,759e,Responses,,,"Beethoven, 1770 - 1827",,"[All things come of Thee, O Lord]",chant_beethoven_33211,3321123432111,English,,
RESPONSES,"All things come of Thee",all_things_come_of_thee_o_lord,"The Hymnary of the United Church of Canada",UCC1930,759d,RESPONSES,,,"Beethoven, 1770-1827",,"[RESPONSES] ",chant_beethoven_33211,3321123432111,English,,
"All things come of Thee, O Lord","All things come of Thee, O Lord",all_things_come_of_thee_o_lord,"Hymnal and Liturgies of the Moravian Church",HLMC1920,945,,,,Beethoven,,"OFFERATORY SENTENCE",chant_beethoven_33211,3321123432111,English,,
"Kyrie Eleison","Itancan, onṡiundapi, qa woope kin de unyuhapi kta e",itancan_onsiundapi_qa_woope,"Okodakiciye Wakan Odowan Qa Okna Ahiyayapi Kta Ho Kin/Hymnal with Tunes and Chants According to the Use of the Episcopal Church in the Missions among the Dakotas ",OWO1951,C20,"Kyrie Eleison",,,,,"[Itancan, onṡiundapi, qa woope kin de unyuhapi kta e]",chant_beethoven_33211,3321123432111,Dakota,,"From Beethoven"
"Offertory Sentences","All things come of Thee, O Lord",all_things_come_of_thee_o_lord,"A. M. E. C. Hymnal",AMEC1954,409,"Offertory Sentences",,,,,"[All things come of Thee, O Lord]",chant_beethoven_33211,3321123432111,English,,"Arr. From Ludwig van Beethoven, 1770-1827"
"All Things Come of Thee","All things come of Thee, O Lord",all_things_come_of_thee_o_lord,"Baptist Hymnal",BH1956,534,"All Things Come of Thee",,,,,"[All things come of Thee, O Lord]",chant_beethoven_33211,3321123432111,English,,"Arr. from Ludwig van Beethoven, 1770-1827"
"All Things Come of Thee, O Lord","All things come of Thee, O Lord",all_things_come_of_thee_o_lord,"A. M. E. C. Hymnal",AMEC1954,605,"All Things Come of Thee, O Lord",,,,,"[All things come of Thee, O Lord]",chant_beethoven_33211,3321123432111,English,"Offertory Sentence","Arr. fr. Beethoven"
"All Things Come of Thee, O Lord","All things come of Thee, O Lord",all_things_come_of_thee_o_lord,"The Mennonite Hymnary, published by the Board of Publication of the General Conference of the Mennonite Church of North America",MHBP1940,612,"All Things Come of Thee, O Lord",,,,,"[All things come of Thee, O Lord]",chant_beethoven_33211,3321123432111,,,"Arr. fr. Beethoven"
"All things come of thee, O Lord","All things come of thee, O Lord",all_things_come_of_thee_o_lord,"The Book of Common Praise: being the hymn book of The Church of England in Canada (revised 1938)",BoCP1938,C180,,,,,,"[All things come of thee, O Lord]",chant_beethoven_33211,3321123432111,English,,"Origin uncertain"
"Offertory Sentences","All things come to thee, O Lord",all_things_come_of_thee_o_lord,"The Church Hymnal: revised and enlarged in accordance with the action of the General Convention of the Protestant Episcopal Church in the United States of America in the year of our Lord 1892. (Ed. B)",HPEC1917,C189,"Offertory Sentences",,,Anon.,,"[All things come to thee, O Lord]",chant_beethoven_33211,3321123432111,,,
"The Offertory","All things come of Thee, O Lord",all_things_come_of_thee_o_lord,"The Hymnal: Army and Navy",ANH1942,p10,"The Offertory",,,,,"[All things come of Thee, O Lord]",chant_beethoven_33211,3321123432111,,,
Offertory,"Taku owasiŋ niye etaŋhaŋ u",taku_owasin_niye_etanhan_u,"Okodakiciye Wakan Odowan Qa Okna Ahiyayapi Kta Ho Kin/Hymnal with Tunes and Chants According to the Use of the Episcopal Church in the Missions among the Dakotas ",OWO1951,C24,Offertory,,,Anon.,,"[Taku owasiŋ niye etaŋhaŋ u]",chant_beethoven_33211,3321123432111,Dakota,"From the ""Church Hymnal"" by permission of Rev. Dr. Hutchins.","From the ""Church Hymnal"" by permission of Rev. Dr. Hutchins."
"All things come of thee, O Lord","All things come of thee, O Lord",all_things_come_of_thee_o_lord,"Pilgrim Songs (Number Two)",PS21902,S19,,,,Anon.,,"[All things come of thee, O Lord]",chant_beethoven_33211,3321123432111,English,,
"All things come of thee, O Lord","All things come of thee, O Lord",all_things_come_of_thee_o_lord,"The Pilgrim Hymnal",PH1904,C21,,,,,,"[All things come of thee, O Lord]",chant_beethoven_33211,3321123432111,English,,
"Presentation of Alms","All things come of Thee, O Lord",all_things_come_of_thee_o_lord,"The Mission Hymnal. (Enlarged Edition)",MHE1914,c4,"Presentation of Alms",,,Anon.,,"[All things come of Thee, O Lord]",chant_beethoven_33211,3321123432111,English,,
"All things come of Thee, O Lord","All things come of Thee, O Lord",all_things_come_of_thee_o_lord,"Songs of the Christian Life",SoCL1912,CCR27,,,,Anon.,,"[All things come of Thee, O Lord]",chant_beethoven_33211,3321123432111,English,,
"All Things Come of Thee","All things come of Thee, O Lord",all_things_come_of_thee_o_lord,"Great Songs of the Church. number two: a treasury of six hundred sacred songs suitable for all services of the church",GSC1937,8,"All Things Come of Thee",,,,,"[All things come of Thee]",chant_beethoven_33211,3321123432111,English,,
"The Lord Is in His Holy Temple","The Lord is in His holy temple",the_lord_is_in_his_holy_temple_let_all,"The Christian Hymnary. Bks. 1-4",CHB41972,9,"The Lord Is in His Holy Temple",,,Anonymous,9.10,"THE LORD IS IN HIS HOLY TEMPLE (Anon.)",chant_beethoven_33211,3321123432111,English,,
"All Things Come of Thee","All things come of Thee, O Lord",all_things_come_of_thee_o_lord,"Praise for the Lord (Expanded Edition)",PFTL1997,32,"All Things Come of Thee",,,"Edward Hopkins",,"[All things come of Thee, O Lord]",chant_beethoven_33211,3321123432111,English,,
"Presentation of Offering","All things come of Thee, O Lord",all_things_come_of_thee_o_lord,"Radio Beams No. 2",RB21945,116,"Presentation of Offering",,,Anon.,,"[All things come of Thee, O Lord]",chant_beethoven_33211,3321123432111,English,,
Response,"All things come of Thee, O Lord; and of Thine own have we given Thee",all_things_come_of_thee_o_lord,Praises,P1905,154,Response,,,,,"[All things come of Thee, O Lord; and of Thine own have we given Thee]",chant_beethoven_33211,3321123432111,English,,