displayTitle,firstLine,textAuthNumber,hymnalTitle,hymnalID,number,textTitle,refrainFirstLine,authors,composers,meter,tuneTitle,tuneAuthNumber,incipit,languages,textSources,tuneSources
"Practical Atheism exposed; or, the Being and Attributes of God asserted","While men grow bold in wicked ways",while_men_grow_bold_in_wicked_ways,"Doctor Watts's imitation of the Psalms of David, to which is added a collection of hymns; the whole applied to the state of the Christian Church in general (3rd ed.)",DWIC1786,64b,"Practical Atheism exposed; or, the Being and Attributes of God asserted",,,,,,,,English,,
"Practical Atheism exposed; or, the Being and Attributes of God asserted","While men grow bold in wicked ways",while_men_grow_bold_in_wicked_ways,"Doctor Watts's Imitation of the Psalms of David: to which is added a collection of hymns; the whole applied to the state of the Christian church in general (4th ed.)",DWI21790,64b,"Practical Atheism exposed; or, the Being and Attributes of God asserted",,,,,,,,English,,
"Practical Atheism exposed; or, the Being and Attributes of God asserted","While men grow bold in wicked ways",while_men_grow_bold_in_wicked_ways,"Doctor Watts's Imitation of the Psalms of David, corrected and enlarged, to which is added a collection of hymns; the whole applied to the state of the Christian Church in general (2nd ed.)",DWIP1786,70,"Practical Atheism exposed; or, the Being and Attributes of God asserted",,,,,,,,English,,
"Practical Atheism exposed; or, the Being and Attributes of God asserted","While men grow bold in wicked ways",while_men_grow_bold_in_wicked_ways,"Doctor Watts's Imitation of the Psalms of David: to which is added a collection of hymns; the whole applied to the state of the Christian church in general (3rd. ed.)",DWIP1787,70,"Practical Atheism exposed; or, the Being and Attributes of God asserted",,,,,,,,English,,
"Practical Atheism expos'd; or, The Being and Attributes of God asserted","While Men grow bold in wicked Ways",while_men_grow_bold_in_wicked_ways,"The Psalms of David: imitated in the language of the New Testament.",PDIL1740,65b,"Practical Atheism expos'd; or, The Being and Attributes of God asserted",,,,,,,,English,,
"The Perfections and Providence of God; or, General Providence and Special Grace","High in the heavens, eternal God",high_in_the_heavens_eternal_god,"Doctor Watts's imitation of the Psalms of David, to which is added a collection of hymns; the whole applied to the state of the Christian Church in general (3rd ed.)",DWIC1786,64a,"The Perfections and Providence of God; or, General Providence and Special Grace",,,,,,,,English,,
"The Perfections and Providence of God; or, General Providence and Special Grace","High in the heavens, eternal God",high_in_the_heavens_eternal_god,"Doctor Watts's Imitation of the Psalms of David: to which is added a collection of hymns; the whole applied to the state of the Christian church in general (4th ed.)",DWI21790,64a,"The Perfections and Providence of God; or, General Providence and Special Grace",,,,,,,,English,,
"The Wickedness of Man, and the Majesty of God; or Practical Atheism exposed","When man grows bold in sin",when_man_grows_bold_in_sin,"Doctor Watts's imitation of the Psalms of David, to which is added a collection of hymns; the whole applied to the state of the Christian Church in general (3rd ed.)",DWIC1786,65,"The Wickedness of Man, and the Majesty of God; or Practical Atheism exposed",,,,,,,,English,,
"The Wickedness of Man, and the Majesty of God; or Practical Atheism exposed","When man grows bold in sin",when_man_grows_bold_in_sin,"Doctor Watts's Imitation of the Psalms of David: to which is added a collection of hymns; the whole applied to the state of the Christian church in general (4th ed.)",DWI21790,65,"The Wickedness of Man, and the Majesty of God; or Practical Atheism exposed",,,,,,,,English,,
"The Perfections and Providence of God; or, General Providence and Special Grace","High in the heavens, eternal God",high_in_the_heavens_eternal_god,"Doctor Watts's Imitation of the Psalms of David, corrected and enlarged, to which is added a collection of hymns; the whole applied to the state of the Christian Church in general (2nd ed.)",DWIP1786,69,"The Perfections and Providence of God; or, General Providence and Special Grace",,,,,,,,English,,
"The Perfections and Providence of God; or, General Providence and Special Grace","High in the heavens, eternal God",high_in_the_heavens_eternal_god,"Doctor Watts's Imitation of the Psalms of David: to which is added a collection of hymns; the whole applied to the state of the Christian church in general (3rd. ed.)",DWIP1787,69,"The Perfections and Providence of God; or, General Providence and Special Grace",,,,,,,,English,,
"The Wickedness of Man, and the Majesty of God; or Practical Atheism exposed","When man grows bold in sin",when_man_grows_bold_in_sin,"Doctor Watts's Imitation of the Psalms of David, corrected and enlarged, to which is added a collection of hymns; the whole applied to the state of the Christian Church in general (2nd ed.)",DWIP1786,71,"The Wickedness of Man, and the Majesty of God; or Practical Atheism exposed",,,,,,,,English,,
"The Wickedness of Man, and the Majesty of God; or Practical Atheism exposed","When man grows bold in sin",when_man_grows_bold_in_sin,"Doctor Watts's Imitation of the Psalms of David: to which is added a collection of hymns; the whole applied to the state of the Christian church in general (3rd. ed.)",DWIP1787,71,"The Wickedness of Man, and the Majesty of God; or Practical Atheism exposed",,,,,,,,English,,
"Great God! thine attributes divine","Great God! thine attributes divine",great_god_thine_attributes_divine,"A Collection of Psalms and Hymns for Christian Worship (10th ed.)",CPHC1833,133,,,Jervis,,8.6.8.6,,,,English,,
"The Divine Nature, Providence, and Grace","Praise ye the Lord; 'tis good to raise",praise_ye_the_lord_tis_good_to_raise,"Doctor Watts's imitation of the Psalms of David, to which is added a collection of hymns; the whole applied to the state of the Christian Church in general (3rd ed.)",DWIC1786,259,"The Divine Nature, Providence, and Grace",,,,,,,,English,,
"The Divine Nature, Providence, and Grace","Praise ye the Lord; 'tis good to raise",praise_ye_the_lord_tis_good_to_raise,"Doctor Watts's Imitation of the Psalms of David: to which is added a collection of hymns; the whole applied to the state of the Christian church in general (4th ed.)",DWI21790,259,"The Divine Nature, Providence, and Grace",,,,,,,,English,,
"Summer and Winter","Let Zion praise the mighty God",let_zion_praise_the_mighty_god,"Doctor Watts's imitation of the Psalms of David, to which is added a collection of hymns; the whole applied to the state of the Christian Church in general (3rd ed.)",DWIC1786,260,"Summer and Winter",,,,,,,,English,,
"Summer and Winter","Let Zion praise the mighty God",let_zion_praise_the_mighty_god,"Doctor Watts's Imitation of the Psalms of David: to which is added a collection of hymns; the whole applied to the state of the Christian church in general (4th ed.)",DWI21790,260,"Summer and Winter",,,,,,,,English,,
"The Seasons of the Year","With songs and honours sounding loud",with_songs_and_honors_sounding_loud,"Doctor Watts's imitation of the Psalms of David, to which is added a collection of hymns; the whole applied to the state of the Christian Church in general (3rd ed.)",DWIC1786,261a,"The Seasons of the Year",,,,,,,,English,,
"The Seasons of the Year","With songs and honours sounding loud",with_songs_and_honors_sounding_loud,"Doctor Watts's Imitation of the Psalms of David: to which is added a collection of hymns; the whole applied to the state of the Christian church in general (4th ed.)",DWI21790,261a,"The Seasons of the Year",,,,,,,,English,,
"The Divine Nature, Providence, and Grace","Praise ye the Lord; 'tis good to raise",praise_ye_the_lord_tis_good_to_raise,"Doctor Watts's Imitation of the Psalms of David, corrected and enlarged, to which is added a collection of hymns; the whole applied to the state of the Christian Church in general (2nd ed.)",DWIP1786,276,"The Divine Nature, Providence, and Grace",,,,,,,,English,,
"The Divine Nature, Providence, and Grace","Praise ye the Lord; 'tis good to raise",praise_ye_the_lord_tis_good_to_raise,"Doctor Watts's Imitation of the Psalms of David: to which is added a collection of hymns; the whole applied to the state of the Christian church in general (3rd. ed.)",DWIP1787,276,"The Divine Nature, Providence, and Grace",,,,,,,,English,,
"Summer and Winter","Let Zion praise the mighty God",let_zion_praise_the_mighty_god,"Doctor Watts's Imitation of the Psalms of David, corrected and enlarged, to which is added a collection of hymns; the whole applied to the state of the Christian Church in general (2nd ed.)",DWIP1786,277,"Summer and Winter",,,,,,,,English,,
"Summer and Winter","Let Zion praise the mighty God",let_zion_praise_the_mighty_god,"Doctor Watts's Imitation of the Psalms of David: to which is added a collection of hymns; the whole applied to the state of the Christian church in general (3rd. ed.)",DWIP1787,277,"Summer and Winter",,,,,,,,English,,
"The Seasons of the Year","With songs and honours sounding loud",with_songs_and_honors_sounding_loud,"Doctor Watts's Imitation of the Psalms of David, corrected and enlarged, to which is added a collection of hymns; the whole applied to the state of the Christian Church in general (2nd ed.)",DWIP1786,278a,"The Seasons of the Year",,,,,,,,English,,
"The Seasons of the Year","With songs and honours sounding loud",with_songs_and_honors_sounding_loud,"Doctor Watts's Imitation of the Psalms of David: to which is added a collection of hymns; the whole applied to the state of the Christian church in general (3rd. ed.)",DWIP1787,278a,"The Seasons of the Year",,,,,,,,English,,
"Great God! thine attributes divine","Great God! thine attributes divine",great_god_thine_attributes_divine,"A Collection of Psalms and Hymns for Christian Worship (6th ed.)",CPHC1832,133,,,Jervis,,8.6.8.6,,,,English,,
"The Wisdom of God in his Works","Songs of immortal praise belong",songs_of_immortal_praise_belong,"Doctor Watts's imitation of the Psalms of David, to which is added a collection of hymns; the whole applied to the state of the Christian Church in general (3rd ed.)",DWIC1786,197,"The Wisdom of God in his Works",,,,,,,,English,,
"The Wisdom of God in his Works","Songs of immortal praise belong",songs_of_immortal_praise_belong,"Doctor Watts's Imitation of the Psalms of David: to which is added a collection of hymns; the whole applied to the state of the Christian church in general (4th ed.)",DWI21790,197,"The Wisdom of God in his Works",,,,,,,,English,,
"The Perfections of God","Great is the Lord; his works of might",great_is_the_lord_his_works_of_might,"Doctor Watts's imitation of the Psalms of David, to which is added a collection of hymns; the whole applied to the state of the Christian Church in general (3rd ed.)",DWIC1786,198a,"The Perfections of God",,,,,,,,English,,
"The Perfections of God","Great is the Lord; his works of might",great_is_the_lord_his_works_of_might,"Doctor Watts's Imitation of the Psalms of David: to which is added a collection of hymns; the whole applied to the state of the Christian church in general (4th ed.)",DWI21790,198a,"The Perfections of God",,,,,,,,English,,
"The Wisdom of God in his Works","Songs of immortal praise belong",songs_of_immortal_praise_belong,"Doctor Watts's Imitation of the Psalms of David, corrected and enlarged, to which is added a collection of hymns; the whole applied to the state of the Christian Church in general (2nd ed.)",DWIP1786,209b,"The Wisdom of God in his Works",,,,,,,,English,,
"The Wisdom of God in his Works","Songs of immortal praise belong",songs_of_immortal_praise_belong,"Doctor Watts's Imitation of the Psalms of David: to which is added a collection of hymns; the whole applied to the state of the Christian church in general (3rd. ed.)",DWIP1787,209b,"The Wisdom of God in his Works",,,,,,,,English,,
"The Perfections of God","Great is the Lord; his works of might",great_is_the_lord_his_works_of_might,"Doctor Watts's Imitation of the Psalms of David, corrected and enlarged, to which is added a collection of hymns; the whole applied to the state of the Christian Church in general (2nd ed.)",DWIP1786,210,"The Perfections of God",,,,,,,,English,,
"The Perfections of God","Great is the Lord; his works of might",great_is_the_lord_his_works_of_might,"Doctor Watts's Imitation of the Psalms of David: to which is added a collection of hymns; the whole applied to the state of the Christian church in general (3rd. ed.)",DWIP1787,210,"The Perfections of God",,,,,,,,English,,
"The Greatness of God","My God, my King, thy various praise",my_god_my_king_thy_various_praise,"Doctor Watts's imitation of the Psalms of David, to which is added a collection of hymns; the whole applied to the state of the Christian Church in general (3rd ed.)",DWIC1786,255a,"The Greatness of God",,,,,,,,English,,
"The Greatness of God","Long as I live I'll bless thy name",long_as_i_live_ill_bless_thy_name,"Doctor Watts's imitation of the Psalms of David, to which is added a collection of hymns; the whole applied to the state of the Christian Church in general (3rd ed.)",DWIC1786,255b,"The Greatness of God",,,,,,,,English,,
"The Greatness of God","My God, my King, thy various praise",my_god_my_king_thy_various_praise,"Doctor Watts's Imitation of the Psalms of David: to which is added a collection of hymns; the whole applied to the state of the Christian church in general (4th ed.)",DWI21790,255a,"The Greatness of God",,,,,,,,English,,
"The Greatness of God","Long as I live I'll bless thy name",long_as_i_live_ill_bless_thy_name,"Doctor Watts's Imitation of the Psalms of David: to which is added a collection of hymns; the whole applied to the state of the Christian church in general (4th ed.)",DWI21790,255b,"The Greatness of God",,,,,,,,English,,
"The Goodness of God","Sweet is the memory of thy grace",sweet_is_the_memory_of_thy_grace,"Doctor Watts's imitation of the Psalms of David, to which is added a collection of hymns; the whole applied to the state of the Christian Church in general (3rd ed.)",DWIC1786,256,"The Goodness of God",,,,,,,,English,,
"The Goodness of God","Sweet is the memory of thy grace",sweet_is_the_memory_of_thy_grace,"Doctor Watts's Imitation of the Psalms of David: to which is added a collection of hymns; the whole applied to the state of the Christian church in general (4th ed.)",DWI21790,256,"The Goodness of God",,,,,,,,English,,
"Mercy to Sufferers; or God hearing Prayer","Let every tongue thy goodness speak",let_every_tongue_thy_goodness_speak,"Doctor Watts's imitation of the Psalms of David, to which is added a collection of hymns; the whole applied to the state of the Christian Church in general (3rd ed.)",DWIC1786,257a,"Mercy to Sufferers; or God hearing Prayer",,,,,,,,English,,
"Mercy to Sufferers; or God hearing Prayer","Let every tongue thy goodness speak",let_every_tongue_thy_goodness_speak,"Doctor Watts's Imitation of the Psalms of David: to which is added a collection of hymns; the whole applied to the state of the Christian church in general (4th ed.)",DWI21790,257a,"Mercy to Sufferers; or God hearing Prayer",,,,,,,,English,,
"The Greatness of God","My God, my King, thy various praise",my_god_my_king_thy_various_praise,"Doctor Watts's Imitation of the Psalms of David, corrected and enlarged, to which is added a collection of hymns; the whole applied to the state of the Christian Church in general (2nd ed.)",DWIP1786,271b,"The Greatness of God",,,,,,,,English,,
"The Greatness of God","My God, my King, thy various praise",my_god_my_king_thy_various_praise,"Doctor Watts's Imitation of the Psalms of David: to which is added a collection of hymns; the whole applied to the state of the Christian church in general (3rd. ed.)",DWIP1787,271b,"The Greatness of God",,,,,,,,English,,
"The Greatness of God","Long as I live I'll bless thy name",long_as_i_live_ill_bless_thy_name,"Doctor Watts's Imitation of the Psalms of David, corrected and enlarged, to which is added a collection of hymns; the whole applied to the state of the Christian Church in general (2nd ed.)",DWIP1786,272,"The Greatness of God",,,,,,,,English,,
"The Greatness of God","Long as I live I'll bless thy name",long_as_i_live_ill_bless_thy_name,"Doctor Watts's Imitation of the Psalms of David: to which is added a collection of hymns; the whole applied to the state of the Christian church in general (3rd. ed.)",DWIP1787,272,"The Greatness of God",,,,,,,,English,,
"The Goodness of God","Sweet is the memory of thy grace",sweet_is_the_memory_of_thy_grace,"Doctor Watts's Imitation of the Psalms of David, corrected and enlarged, to which is added a collection of hymns; the whole applied to the state of the Christian Church in general (2nd ed.)",DWIP1786,273a,"The Goodness of God",,,,,,,,English,,
"Mercy to Sufferers; or God hearing Prayer","Let every tongue thy goodness speak",let_every_tongue_thy_goodness_speak,"Doctor Watts's Imitation of the Psalms of David, corrected and enlarged, to which is added a collection of hymns; the whole applied to the state of the Christian Church in general (2nd ed.)",DWIP1786,273b,"Mercy to Sufferers; or God hearing Prayer",,,,,,,,English,,
"The Goodness of God","Sweet is the memory of thy grace",sweet_is_the_memory_of_thy_grace,"Doctor Watts's Imitation of the Psalms of David: to which is added a collection of hymns; the whole applied to the state of the Christian church in general (3rd. ed.)",DWIP1787,273a,"The Goodness of God",,,,,,,,English,,
"Mercy to Sufferers; or God hearing Prayer","Let every tongue thy goodness speak",let_every_tongue_thy_goodness_speak,"Doctor Watts's Imitation of the Psalms of David: to which is added a collection of hymns; the whole applied to the state of the Christian church in general (3rd. ed.)",DWIP1787,273b,"Mercy to Sufferers; or God hearing Prayer",,,,,,,,English,,
"The Perfections and Providecn of God; or, General Providence, and Special Grace","High in the Heav'ns, eternal GOD",high_in_the_heavens_eternal_god,"The Psalms of David: imitated in the language of the New Testament.",PDIL1740,65a,"The Perfections and Providecn of God; or, General Providence, and Special Grace",,,,,,,,English,,
"The Wickedness of Man, and the Majesty of God; or, Practical Atheism exposed","When Man grows bold in Sin",when_man_grows_bold_in_sin,"The Psalms of David: imitated in the language of the New Testament.",PDIL1740,66,"The Wickedness of Man, and the Majesty of God; or, Practical Atheism exposed",,,,,,,,English,,
"Psalm 36","When man grows bold in sin",when_man_grows_bold_in_sin,"Psalms and Hymns of Isaac Watts, The",PHW,Ps.85,"Psalm 36",,"Isaac Watts",,6.6.8.6,,,,English,,
"When Man grows bold in Sin","When Man grows bold in Sin",when_man_grows_bold_in_sin,"The Psalms of David: imitated in the language of the New Testament, and applied to the Christian state and worship (27th ed.)",PDIL1766,P36c,,,,,,,,,English,,
"The Lord is King! lift up thy voice","The Lord is King!  lift up thy voice",the_lord_is_king_lift_up_thy_voice,"The Book of Praise",BoPR1972,88,"The Lord is King! lift up thy voice",,"Josiah Conder, 1789-1855",,8.8.8.8,WALTON,germany_beethoven_gardiner,51712567111762765455,English,,
"Psalm 36","High in the heav'ns, eternal God",high_in_the_heavens_eternal_god,"Psalms and Hymns of Isaac Watts, The",PHW,Ps.83,"Psalm 36",,"Isaac Watts",,8.8.8.8,,,,English,,
"Psalm 36","While men grow bold in wicked ways",while_men_grow_bold_in_wicked_ways,"Psalms and Hymns of Isaac Watts, The",PHW,Ps.84,"Psalm 36",,"Isaac Watts",,8.6.8.6,,,,English,,
"High in the Heav'ns, eternal GOD","High in the Heav'ns, eternal GOD",high_in_the_heavens_eternal_god,"The Psalms of David: imitated in the language of the New Testament, and applied to the Christian state and worship (27th ed.)",PDIL1766,P36a,,,,,,,,,English,,
"While Men grow bold in wicked Ways","While Men grow bold in wicked Ways",while_men_grow_bold_in_wicked_ways,"The Psalms of David: imitated in the language of the New Testament, and applied to the Christian state and worship (27th ed.)",PDIL1766,P36b,,,,,,,,,English,,
"Psalm 147  Part 2","O Britain, praise thy mighty God",let_zion_praise_the_mighty_god,"Psalms and Hymns of Isaac Watts, The",PHW,Ps.333,"Psalm 147  Part 2",,"Isaac Watts",,8.8.8.8,,,,English,,
"Psalm 147","With songs and honors sounding loud",with_songs_and_honors_sounding_loud,"Psalms and Hymns of Isaac Watts, The",PHW,Ps.334,"Psalm 147",,"Isaac Watts",,8.6.8.6,,,,English,,
"O Britain, praise thy mighty GOD","O Britain, praise thy mighty GOD",let_zion_praise_the_mighty_god,"The Psalms of David: imitated in the language of the New Testament, and applied to the Christian state and worship (27th ed.)",PDIL1766,P147b,,,,,,,,,English,,
"Summer and Winter: A Song for Great-Britain","O Britain, praise thy mighty GOD",let_zion_praise_the_mighty_god,"The Psalms of David: imitated in the language of the New Testament.",PDIL1740,271,"Summer and Winter: A Song for Great-Britain",,,,,,,,English,,
"Psalm 147  Part 1","Praise ye the Lord; 'tis good to raise",praise_ye_the_lord_tis_good_to_raise,"Psalms and Hymns of Isaac Watts, The",PHW,Ps.332,"Psalm 147  Part 1",,"Isaac Watts",,8.8.8.8,,,,English,,
"Praise ye the Lord; 'tis good to raise","Praise ye the Lord; 'tis good to raise",praise_ye_the_lord_tis_good_to_raise,"The Psalms and Hymns of Dr. Watts",PHDW1835,76,,,"Isaac Watts",,8.8.8.8,,,,English,,
"Praise ye the Lord: 'Tis good to raise","Praise ye the Lord: 'Tis good to raise",praise_ye_the_lord_tis_good_to_raise,"The Psalms of David: imitated in the language of the New Testament, and applied to the Christian state and worship (27th ed.)",PDIL1766,P147a,,,,,,,,,English,,
"With Songs and Honours sounding loud","With Songs and Honours sounding loud",with_songs_and_honors_sounding_loud,"The Psalms of David: imitated in the language of the New Testament, and applied to the Christian state and worship (27th ed.)",PDIL1766,P147c,,,,,,,,,English,,
"The Divine Nature, Providence and Grace","Praise ye the Lord: 'Tis good to raise",praise_ye_the_lord_tis_good_to_raise,"The Psalms of David: imitated in the language of the New Testament.",PDIL1740,270,"The Divine Nature, Providence and Grace",,,,,,,,English,,
"The Seasons of the Year","With Songs and Honours sounding loud",with_songs_and_honors_sounding_loud,"The Psalms of David: imitated in the language of the New Testament.",PDIL1740,272,"The Seasons of the Year",,,,,,,,English,,
"O God, thou bottomless abyss!","O God, thou bottomless abyss!",o_god_thou_bottomless_abyss,"The Voice of Praise: a collection of hymns for the use of the Methodist Church",VoP1873,48,,,"J. Wesley",,8.8.8.8,,,,,,
"Friend of God","Who am I that You are mindful of me",who_am_i_that_you_are_mindful_of_me,"Baptist Hymnal 2008",BH2008,483,"Friend of God","I am a friend of God","Michael Gungor; Israel Houghton","Michael Gungor; Israel Houghton",Irregular,"FRIEND OF GOD",friend_of_god,,English,,
"I Sing the Mighty Power of God ","I sing the mighty power of God ",i_sing_the_mighty_power_of_god,"Baptist Hymnal 2008",BH2008,48,"I Sing the Mighty Power of God ",,"Isaac Watts",,"8.6.8.6 D",ELLACOMBE,ellacombe,517651345567122,English,,"<cite>Gesangbuch der Herzogl</cite>, Wittenberg"
"I Sing the Mighty Power of God","I sing the mighty power of God ",i_sing_the_mighty_power_of_god,"Baptist Hymnal 2008",BH2008,49,"I Sing the Mighty Power of God",,"Isaac Watts","Ralph Vaughan Williams, 1872-1958","8.6.8.6 D","FOREST GREEN",forest_green_english,511123234534312,English,,
"O God, our help in ages past","O God, our help in ages past",our_god_our_help_in_ages_past_watts,"The Book of Praise",BoPR1972,87,"O God, our help in ages past",,"Isaac Watts, 1674-1748","William Croft, 1678 - 1727",8.6.8.6,"ST. ANNE",st_anne_croft,53651171515645,English,,