hymnalTitle,displayTitle,firstLine,textAuthNumber,hymnalID,number,textTitle,refrainFirstLine,authors,composers,meter,tuneTitle,tuneAuthNumber,incipit,languages,textSources,tuneSources
"A. M. E. C. Hymnal","Offertory Sentences","All things come of Thee, O Lord",all_things_come_of_thee_o_lord,AMEC1954,409,"Offertory Sentences",,,,,"[All things come of Thee, O Lord]",chant_beethoven_33211,3321123432111,English,,"Arr. From Ludwig van Beethoven, 1770-1827"
"A. M. E. C. Hymnal","All Things Come of Thee","All things come of Thee, O Lord",all_things_come_of_thee_o_lord,AMEC1954,558,"All Things Come of Thee",,,"Ludwig van Beethoven, 1770-1827",,"PRESENTATION OF THE OFFERING FOR THE NEEDY",chant_beethoven_33211,3321123432111,English,,
"A. M. E. C. Hymnal","All Things Come of Thee, O Lord","All things come of Thee, O Lord",all_things_come_of_thee_o_lord,AMEC1954,605,"All Things Come of Thee, O Lord",,,,,"[All things come of Thee, O Lord]",chant_beethoven_33211,3321123432111,English,"Offertory Sentence","Arr. fr. Beethoven"
"African American Heritage Hymnal","All Things Come of Thee","All things come of Thee, O Lord",all_things_come_of_thee_o_lord,AAHH2001,668,"All Things Come of Thee",,,"Ludwig van Beethoven, 1770-1827",,"[All things come of Thee, O Lord]",chant_beethoven_33211,3321123432111,English,,
"African Methodist Episcopal Church Hymnal","All Things Come of Thee","All things come of Thee, O Lord",all_things_come_of_thee_o_lord,AMEC1984,644,"All Things Come of Thee",,,"Ludwig van Beethoven, 1770-1827",,"[All things come of Thee, O Lord]",chant_beethoven_33211,3321123432111,English,,
"American Church and Church School Hymnal: a new religious educational hymnal","All things come of Thee, O Lord","All things come of Thee, O Lord",all_things_come_of_thee_o_lord,ACCS1927,376,,,,Beethoven,,OFFERING,chant_beethoven_33211,3321123432111,English,,
"American Junior Church School Hymnal","All things come of Thee, O Lord","All things come of Thee, O Lord",all_things_come_of_thee_o_lord,AJCS1929,217,,,,Anonymous,,"[All things come of Thee, O Lord]",chant_beethoven_33211,3321123432111,English,,
"At Worship: a hymnal for young churchmen","All things come of thee, O Lord","All things come of thee, O Lord",all_things_come_of_thee_o_lord,AW41951,R5,,,,"Ludwig van Beethoven",,"[All things come of thee, O Lord]",chant_beethoven_33211,3321123432111,English,,
"Baptist Hymnal","All Things Come of Thee","All things come of Thee, O Lord",all_things_come_of_thee_o_lord,BH1956,534,"All Things Come of Thee",,,,,"[All things come of Thee, O Lord]",chant_beethoven_33211,3321123432111,English,,"Arr. from Ludwig van Beethoven, 1770-1827"
"Chalice Hymnal","All Things Come of Thee","All things come of thee, O Lord",all_things_come_of_thee_o_lord,CH1995,380,"All Things Come of Thee",,,Anonymous,Irregular,OFFERING,chant_beethoven_33211,3321123432111,English,"1 Chronicles 29:14b",
"Christ in Song: for all religious services nearly one thousand best gospel hymns, new and old with responsive scripture readings (Rev. and Enl.)","On Presentation of Offering","All things come of Thee, O Lord",all_things_come_of_thee_o_lord,CSR1908,472,"On Presentation of Offering",,,Anon.,,"[All things come of Thee, O Lord]",chant_beethoven_33211,3321123432111,English,,
"Christian Praise","All Things Come of Thee","All things come of Thee, O Lord",all_things_come_of_thee_o_lord,CP1964,459,"All Things Come of Thee",,,"Ludwig van Beethoven",,"[All things come of Thee, O Lord]",chant_beethoven_33211,3321123432111,English,,
"Christian Service Songs","All Things Come Of Thee","All things come of Thee, O Lord",all_things_come_of_thee_o_lord,CSS1939,310,"All Things Come Of Thee",,,Beethoven,,"[All things come of Thee, O Lord] ",chant_beethoven_33211,3321123432111,English,,
"Christian Song","All things come of Thee, O Lord","All things come of Thee, O Lord",all_things_come_of_thee_o_lord,CS1926,424,,,,Beethoven,,"[All things come of Thee, O Lord]",chant_beethoven_33211,3321123432111,English,,
"Christian Worship: a hymnal","All things come of Thee, O Lord","All things come of Thee, O Lord",all_things_come_of_thee_and_of_thine_own,CW1941,634,,,,"Ludwig van Beethoven, 1770-1827 Arr. From",,"[All things come of Thee, O Lord]",chant_beethoven_33211,3321123432111,English,,
"Church Service Hymns","All Things Come of Thee","All things come of Thee, O Lord",all_things_come_of_thee_o_lord,CSH1948,439,"All Things Come of Thee",,,Beethoven,,"[All things come of Thee, O Lord]",chant_beethoven_33211,3321123432111,English,,
"Cántico Nuevo: Himnario Evangelico","Todo Viene de Ti, Señor","Todo viene de ti, oh Dios",todo_viene_de_ti_oh_dios,CNHE1962,463,"Todo Viene de Ti, Señor",,,"Ludwig van Beethoven, 1770-1827",,"[Todo viene de ti, oh Dios]",chant_beethoven_33211,3321123432111,Spanish,,
"El Himnario","Todo de Ti Viene, Oh Dios","Todo de Ti viene, oh Dios",todo_de_ti_viene_oh_dios,EH1964,428,"Todo de Ti Viene, Oh Dios",,,"Ludwig Van Beethoven",,"[Todo de Ti viene, oh Dios]",chant_beethoven_33211,3321123432111,Spanish,,
"El Himnario para el uso de las Iglesias Evangelicas de Habla Espanola en Todo el Mundo","Todo es tuyo","Todo es tuyo",todo_es_tuyo_y_lo_recibido,EHIE1931,491,,,,,,"LAS OFRENDAS",chant_beethoven_33211,3321123432111,Spanish,,
"Great Hymns of the Faith","All Things Come of Thee","All things come of Thee, O Lord",all_things_come_of_thee_o_lord,GHF1968,537,"All Things Come of Thee",,,"Ludwig van Beethoven, 1770-1827",,"[All things come of Thee, O Lord]",chant_beethoven_33211,3321123432111,English,,
"Great Songs of the Church. number two: a treasury of six hundred sacred songs suitable for all services of the church","All Things Come of Thee","All things come of Thee, O Lord",all_things_come_of_thee_o_lord,GSC1937,8,"All Things Come of Thee",,,,,"[All things come of Thee]",chant_beethoven_33211,3321123432111,English,,
"Great Songs of the Church: number two: a treasury of six hundred sacred songs suitable for all services of the church","All Things Come of Thee","All things come of Thee, O Lord",all_things_come_of_thee_o_lord,GSoC1975,8,"All Things Come of Thee",,,Beethoven,,"[All things come of Thee]",chant_beethoven_33211,3321123432111,English,"I Chronicles 29:14",
"Himnario Metodista: Preparado y editado bajo la dirección del Comité del Himnario de la Conferencia Río Grande de La Iglesia Metodista Unida","Todo es de Ti II","Todo es de Ti, Señor",todo_es_de_ti_senor,HM1973,381,"Todo es de Ti II",,"Anita Gonzalez","Ludwig van Beethoven, 1770-1827",,"[Todo es de Ti, Señor]",chant_beethoven_33211,3321123432111,Spanish,,
"Hymnal and Liturgies of the Moravian Church","All Things Come of Thee, O Lord","All things come of Thee, O Lord",all_things_come_of_thee_o_lord,HLMC1969,608,"All Things Come of Thee, O Lord",,,Beethoven,,"[All things come of Thee, O Lord]",chant_beethoven_33211,3321123432111,English,,
"Hymnal and Liturgies of the Moravian Church","All things come of Thee, O Lord","All things come of Thee, O Lord",all_things_come_of_thee_o_lord,HLMC1920,945,,,,Beethoven,,"OFFERATORY SENTENCE",chant_beethoven_33211,3321123432111,English,,
"Hymnbook for Christian Worship","All Things Come of Thee","All things come of thee, O Lord",all_things_come_of_thee_o_lord,H4CW1970,399,"All Things Come of Thee",,,"Ludwig van Beethoven, 1770-1827",,"[All things come of Thee, O Lord]",chant_beethoven_33211,3321123432111,English,,
"Hymns for Creative Living","All Things Come of Thee, O Lord","All things come of Thee, O Lord",all_things_come_of_thee_o_lord,H4CL1935,194,"All Things Come of Thee, O Lord",,,Beethoven,,"[All things come of Thee, O Lord]",chant_beethoven_33211,3321123432111,English,,
"Hymns for Junior Worship","All Things Come of Thee, O Lord","All things come of Thee, O Lord",all_things_come_of_thee_o_lord,H4JW1940,129,"All Things Come of Thee, O Lord",,,"Ludwig van Beethoven (1770-1827)",,"[All things come of Thee, O Lord]",chant_beethoven_33211,3321123432111,English,,
"Hymns for the Living Age","All things come of thee, O Lord, and of thine own","All things come of thee, O Lord, and of thine own",all_things_come_of_thee_o_lord,H4LA1923,526,,,,Beethoven,,OFFERINGS,chant_beethoven_33211,3321123432111,English,,
"Hymns for Worship","All things come of Thee, O Lord","All things come of Thee, O Lord",all_things_come_of_thee_o_lord,H4W1939,221,,,,,,"[All things come of Thee, O Lord]",chant_beethoven_33211,3321123432111,English,,
"Hymns of Blessing for the Living Church: the best of the old and the latest of the new, suited to the church and home, the Sunday school, the brotherhoods, the young peoples' meetings...","Presentation of Offering","All things come of Thee, O Lord",all_things_come_of_thee_o_lord,HBLC1916,190,"Presentation of Offering",,,Anon.,,"[All things come of Thee, O Lord]",chant_beethoven_33211,3321123432111,English,,
"Hymns of Heavenly Harmony","Presentation of Offering","All things come of Thee, O Lord",all_things_come_of_thee_o_lord,HoHH1910,281,"Presentation of Offering",,,,,"[All things come of Thee, O Lord]",chant_beethoven_33211,3321123432111,English,,
"Hymns of the Christian Life","All things come of Thee, O Lord","All things come of Thee, O Lord",all_things_come_of_thee_o_lord,HoCL1925,527,,,,Beethoven,,"[All things come of Thee, O Lord]",chant_beethoven_33211,3321123432111,English,,
"Hymns of the Church: new and old",Offertory,"All things come of thee, O Lord",all_things_come_of_thee_o_lord,HCNO1912,593,Offertory,,,Beethoven,,"[All things come of thee, O Lord]",chant_beethoven_33211,3321123432111,English,,
"Hymns of the Kingdom of God","All things come of Thee, O Lord, and of Thine own have we given Thee","All things come of Thee, O Lord, and of Thine own have we given Thee",all_things_come_of_thee_o_lord,HoKo1923,457,,,,"Beethoven, 1770-1827",,"[All things come of Thee, O Lord, and of Thine own have we given Thee]",chant_beethoven_33211,3321123432111,English,,
"Hymns of the Kingdom of God","All things come of Thee, O Lord, and of Thine own have we given Thee","All things come of Thee, O Lord, and of Thine own have we given Thee",all_things_come_of_thee_o_lord,HoKo1926,457,,,,"Beethoven, 1770-1827",,"[All things come of Thee, O Lord, and of Thine own have we given Thee]",chant_beethoven_33211,3321123432111,English,,
"Hymns of Worship and Service: (12th ed.)","All things come of Thee, O Lord","All things come of Thee, O Lord",all_things_come_of_thee_o_lord,HoWS1909,573,,,,Beethoven,,"[All things come of Thee, O Lord]",chant_beethoven_33211,3321123432111,English,,
"Hymns of Worship and Service: (12th ed.)","Lord have mercy upon us, and incline our hearts to keep this law","Lord have mercy upon us, and incline our hearts to keep this law",lord_have_mercy_upon_us_and_incline_our_,HoWS1909,575,,,,Beethoven,,"[Lord have mercy upon us, and incline our hearts to keep this law]",chant_beethoven_33211,3321123432111,English,,
"In Excelsis for School and Chapel","All things come of Thee, O Lord","All things come of Thee, O Lord",all_things_come_of_thee_o_lord,IESC1900,305,,,,Anon.,,"[All things come of Thee, O Lord]",chant_beethoven_33211,3321123432111,English,,
"International Praise: for the Sunday school and church","Response No. 2","All things come of Thee, O Lord",all_things_come_of_thee_o_lord,IP1902,273,"Response No. 2",,,,,"[All things come of Thee, O Lord]",chant_beethoven_33211,3321123432111,English,,
"Junior Church School Hymnal: for use in the junior section of the church school, in the home, and in junior congragations (Teacher's Edition)","All things come of Thee, O Lord","All things come of Thee, O Lord",all_things_come_of_thee_o_lord,JCSH1927,184,,,,Beethoven,,"[All things come of Thee, O Lord]",chant_beethoven_33211,3321123432111,English,,
"Mount Hermon Melodies, book two","All Things Come of Thee","All things come of Thee, O Lord; and of Thine own have we given Thee",all_things_come_of_thee_o_lord,MHM21944,28,"All Things Come of Thee",,,Beethoven,,"[All things come of Thee, O Lord; and of Thine own have we given Thee]",chant_beethoven_33211,3321123432111,English,,
"New Baptist Hymnal: containing standard and Gospel hymns and responsive readings","Lord, have mercy upon us, and incline our hearts to keep this law","Lord, have mercy upon us, and incline our hearts to keep this law",lord_have_mercy_upon_us_and_incline_our_,NBH1926,421,,,,Beethoven,,"[Lord, have mercy upon us, and incline our hearts to keep this law]",chant_beethoven_33211,3321123432111,English,,
"New Baptist Hymnal: containing standard and Gospel hymns and responsive readings","All things come of thee, O Lord","All things come of thee, O Lord",all_things_come_of_thee_o_lord,NBH1926,422a,,,,Beethoven,,"[All things come of thee, O Lord]",chant_beethoven_33211,3321123432111,English,,
"New Soul Winning Songs","Presentation of Offering","All things come of Thee, O Lord",all_things_come_of_thee_o_lord,NSWS1926,322,"Presentation of Offering",,,,,"[All things come of Thee, O Lord]",chant_beethoven_33211,3321123432111,English,,
"New Worship and Song: with Worship Services and Source Materials","All things come of thee, O Lord","All things come of thee, O Lord",all_things_come_of_thee_o_lord,NWSW1942,128,,,,Beethoven,,"[All things come of thee, O Lord]",chant_beethoven_33211,3321123432111,English,,
"Okodakiciye Wakan Odowan Qa Okna Ahiyayapi Kta Ho Kin/Hymnal with Tunes and Chants According to the Use of the Episcopal Church in the Missions among the Dakotas ","Kyrie Eleison","Itancan, onṡiundapi, qa woope kin de unyuhapi kta e",itancan_onsiundapi_qa_woope,OWO1951,C20,"Kyrie Eleison",,,,,"[Itancan, onṡiundapi, qa woope kin de unyuhapi kta e]",chant_beethoven_33211,3321123432111,Dakota,,"From Beethoven"
"Okodakiciye Wakan Odowan Qa Okna Ahiyayapi Kta Ho Kin/Hymnal with Tunes and Chants According to the Use of the Episcopal Church in the Missions among the Dakotas ",Offertory,"Taku owasiŋ niye etaŋhaŋ u",taku_owasin_niye_etanhan_u,OWO1951,C24,Offertory,,,Anon.,,"[Taku owasiŋ niye etaŋhaŋ u]",chant_beethoven_33211,3321123432111,Dakota,"From the ""Church Hymnal"" by permission of Rev. Dr. Hutchins.","From the ""Church Hymnal"" by permission of Rev. Dr. Hutchins."
"One Lord, One Faith, One Baptism: an African American ecumenical hymnal","All Things Come of Thee","All things come of Thee, O Lord",all_things_come_of_thee_o_lord,OLOF2018,668,"All Things Come of Thee",,,"Ludwig van Beethoven, 1770-1827",,"[All things come of Thee, O Lord]",chant_beethoven_33211,33333212111234321,English,,
"Pilgrim Hymnal","All Things Come of Thee, O Lord","All things come of thee, O Lord",all_things_come_of_thee_o_lord,PH1958,536,"All Things Come of Thee, O Lord",,,"Ludwig Van Beethoven, 1770-1827",,"[All things come of thee, O Lord]",chant_beethoven_33211,3321123432111,English,,
"Pilgrim Songs (Number Two)","All things come of thee, O Lord","All things come of thee, O Lord",all_things_come_of_thee_o_lord,PS21902,S19,,,,Anon.,,"[All things come of thee, O Lord]",chant_beethoven_33211,3321123432111,English,,
"Praise for the Lord (Expanded Edition)","All Things Come of Thee","All things come of Thee, O Lord",all_things_come_of_thee_o_lord,PFTL1997,32,"All Things Come of Thee",,,"Edward Hopkins",,"[All things come of Thee, O Lord]",chant_beethoven_33211,3321123432111,English,,
Praises,Response,"All things come of Thee, O Lord; and of Thine own have we given Thee",all_things_come_of_thee_o_lord,P1905,154,Response,,,,,"[All things come of Thee, O Lord; and of Thine own have we given Thee]",chant_beethoven_33211,3321123432111,English,,
"Radio Beams No. 2","Presentation of Offering","All things come of Thee, O Lord",all_things_come_of_thee_o_lord,RB21945,116,"Presentation of Offering",,,Anon.,,"[All things come of Thee, O Lord]",chant_beethoven_33211,3321123432111,English,,
"Revival Hymns and Choruses","All Things Come of Thee","All things come of Thee, O Lord",all_things_come_of_thee_o_lord,RHC,519,"All Things Come of Thee",,,"Ludwig van Beethoven, 1770-1827",,"[All things come of Thee, O Lord]",chant_beethoven_33211,3321123432111,English,,
"Services for Congregational Worship. The New Hymn and Tune Book","All things come of thee, O Lord","All things come of thee, O Lord",all_things_come_of_thee_o_lord,SCWI1914,547,,,,"Ludwig van Beethoven",,"ALL THINGS COME OF THEE, O LORD",chant_beethoven_33211,3321123432111,English,,
"Seventh-day Adventist Hymnal","All Things Come of Thee","All things come of Thee, O Lord",all_things_come_of_thee_o_lord,SDAH1985,665,"All Things Come of Thee",,,Anon.,,"[Chant] (Beethoven 33211)",chant_beethoven_33211,"	33211 23432 111",,"<cite>From </cite>Christ in Song, <cite>1908</cite>",
"Songs for the King's Business","Presentation of Offering","All things come of thee, O Lord",all_things_come_of_thee_o_lord,S4KB1909,370,"Presentation of Offering",,,Anon.,,"[All things come of thee, O Lord]",chant_beethoven_33211,3321123432111,,,
"Songs of the Christian Life","All things come of Thee, O Lord","All things come of Thee, O Lord",all_things_come_of_thee_o_lord,SoCL1912,CCR27,,,,Anon.,,"[All things come of Thee, O Lord]",chant_beethoven_33211,3321123432111,English,,
"The A.M.E. Zion Hymnal: official hymnal of the African Methodist Episcopal Zion Church","All Things Come Of Thee","All things come of Thee, O Lord",all_things_come_of_thee_o_lord,AMEZ1996,706,"All Things Come Of Thee",,,"Ludwig van Beethoven, 1770-1827",,"[All things come of Thee, O Lord]",chant_beethoven_33211,3321123432111,English,,
"The Abingdon Hymnal: a Book of Worship for Youth","All things come of thee, O Lord: and of thine own have we given thee","All things come of thee, O Lord: and of thine own have we given thee",all_things_come_of_thee_o_lord,AHBW1928,298,,,,Anonymous,,"[All things come of thee, O Lord: and of thine own have we given thee]",chant_beethoven_33211,3321123432111,English,,
"The Abingdon Song Book","All Things Come of Thee","All things come of Thee, O Lord",all_things_come_of_thee_o_lord,ASB1938,301,"All Things Come of Thee",,,Beethoven,,"[All things come of Thee, O Lord]",chant_beethoven_33211,3321123432111,English,,
"The Beacon Hymnal: for Church Schools, Young People's Services, Day Schools, and the Home","All things come of Thee, O Lord","All things come of Thee, O Lord",all_things_come_of_thee_o_lord,BH1924,S13,,,,"Ludwig van Beethoven",,"[All things come of Thee, O Lord]",chant_beethoven_33211,3321123432111,English,,
"The Book of Common Praise: being the hymn book of The Church of England in Canada (revised 1938)","All things come of thee, O Lord","All things come of thee, O Lord",all_things_come_of_thee_o_lord,BoCP1938,C180,,,,,,"[All things come of thee, O Lord]",chant_beethoven_33211,3321123432111,English,,"Origin uncertain"
"The Book of Worship of the Church School","All things come of Thee, O Lord","All things come of Thee, O Lord",all_things_come_of_thee_o_lord,BWCS1915,157c,,,,Beethoven,,"[All things come of Thee, O Lord]",chant_beethoven_33211,3321123432111,English,,
"The Broadman Hymnal","All Things Come of Thee, O Lord","All things come of Thee, O Lord",all_things_come_of_thee_o_lord,BH1940,491,"All Things Come of Thee, O Lord",,,Beethoven,,"[All things come of Thee, O Lord]",chant_beethoven_33211,3321123432111,English,,
"The Christian Hymnary. Bks. 1-4","The Lord Is in His Holy Temple","The Lord is in His holy temple",the_lord_is_in_his_holy_temple_let_all,CHB41972,9,"The Lord Is in His Holy Temple",,,Anonymous,9.10,"THE LORD IS IN HIS HOLY TEMPLE (Anon.)",chant_beethoven_33211,3321123432111,English,,
"The Church Hymnal: revised and enlarged in accordance with the action of the General Convention of the Protestant Episcopal Church in the United States of America in the year of our Lord 1892. (Ed. B)","Offertory Sentences","All things come to thee, O Lord",all_things_come_of_thee_o_lord,HPEC1917,C189,"Offertory Sentences",,,Anon.,,"[All things come to thee, O Lord]",chant_beethoven_33211,3321123432111,,,
"The Church School Hymnal for Youth","All Things Come of Thee, O Lord","All things comes of Thee, O Lord",all_things_come_of_thee_o_lord,CSHY1928,366,"All Things Come of Thee, O Lord",,,Beethoven,,"[All things comes to Thee, O Lord]",chant_beethoven_33211,3321123432111,English,,
"The Endeavor Hymnal: for Young People's Societies, Sunday Schools and Church Prayer Meetings","Response after the Offering","All things come of Thee, O Lord",all_things_come_of_thee_o_lord,EHYP1901,311,"Response after the Offering",,,,,"[All things come of Thee, O Lord]",chant_beethoven_33211,3321123432111,English,,
"The Hymnal","All things come of Thee, O Lord","All things come of Thee, O Lord",all_things_come_of_thee_o_lord,HPAG1933,R26,,,,"Ludwig van Beethoven (1770-1827)",,"[All things come of Thee, O Lord]",chant_beethoven_33211,3321123432111,,,
"The Hymnal","All things come of thee, O Lord","All things come of thee, O Lord",all_things_come_of_thee_o_lord,H1956,554,,,,"Ludwig van Beethoven, 1770-1827",,"ALL THINGS COME OF THEE",chant_beethoven_33211,3321123432111,,,
"The Hymnal and Order of Service",Offertory,"All things come of Thee, O Lord",all_things_come_of_thee_o_lord,HOoS1926,676,Offertory,,,"Ludwig van Beethoven, (1770-1827)",,"[All things come of Thee, O Lord]",chant_beethoven_33211,3321123432111,English,,
"The Hymnal for Boys and Girls","All Things Come of Thee, O Lord","All things come of thee, O Lord",all_things_come_of_thee_o_lord,H4BG1935,153,"All Things Come of Thee, O Lord",,,"Ludwig van Beethoven",Irregular,OFFERTORY,chant_beethoven_33211,3321123432111,,,
"The Hymnal for Young People","All things come of Thee, O Lord; and of Thine own have we given Thee","All things come of Thee, O Lord; and of Thine own have we given Thee",all_things_come_of_thee_o_lord,H4YP1928,307,,,,Beethoven,,"[All things come of Thee, O Lord; and of Thine own have we given Thee]",chant_beethoven_33211,3321123432111,English,,
"The Hymnal for Youth","All things come of Thee, O Lord","All things come of Thee, O Lord",all_things_come_of_thee_o_lord,THfY1941,314,,,,"Ludwig van Beethoven",,"[All things come of Thee, O Lord]",chant_beethoven_33211,3321123432111,English,,
"The Hymnal of The Evangelical United Brethren Church","All Things Come of Thee","All things come of Thee, O Lord",all_things_come_of_thee_o_lord,HEUB1957,467,"All Things Come of Thee",,,"Ludwig van Beethoven, d. 1827",,"[All things come of Thee, O Lord]",chant_beethoven_33211,3321123432111,,,
"The Hymnal of the Protestant Episcopal Church in the United States of America 1940","All things come of thee, O Lord","All things come of thee, O Lord",all_things_come_of_thee_o_lord,HPEC1940,733,,,,Anonymous,,"[All things come of thee, O Lord]",chant_beethoven_33211,3321123432111,,,
"The Hymnal: Army and Navy","The Offertory","All things come of Thee, O Lord",all_things_come_of_thee_o_lord,ANH1942,p10,"The Offertory",,,,,"[All things come of Thee, O Lord]",chant_beethoven_33211,3321123432111,,,
"The Hymnal: as authorized and approved by the General Convention of the Protestant Episcopal Church in the United States of America in the year of our Lord 1916","At the Presentation of Alms","All things come of thee, O Lord",all_things_come_of_thee_o_lord,EH1916,C137,"At the Presentation of Alms",,,"Ludwig van Beethoven",,"[All things come of thee, O Lord]",chant_beethoven_33211,3321123432111,,,
"The Hymnal: Containing Complete Orders of Worship. Authorized by the General Synod of the Evangelical and Reformed Church","All things come of Thee, O Lord: and of Thine own have we given Thee","All things come of Thee, O Lord: and of Thine own have we given Thee",all_things_come_of_thee_o_lord,HAGS1941,505,,,,"Ludwig van Beethoven",,"[Hear, O Lord, our humble supplication]",chant_beethoven_33211,3321123432111,English,,
"The Hymnary for use in Baptist churches",Responses,"All things come of Thee, O Lord",all_things_come_of_thee_o_lord,H4B1936,759e,Responses,,,"Beethoven, 1770 - 1827",,"[All things come of Thee, O Lord]",chant_beethoven_33211,3321123432111,English,,