hymnalTitle,displayTitle,firstLine,textAuthNumber,hymnalID,number,textTitle,refrainFirstLine,authors,composers,meter,tuneTitle,tuneAuthNumber,incipit,languages,textSources,tuneSources
"Bible Songs: a collection of psalms set to music for use in church and evangelistic services, prayer meetings, Sabbath schools, young people's societies, and family worship (Rev. and enl.ed)","The Evil-Doer Warned","O mighty man, why boast in sin",o_mighty_man_why_boast_in_sin,BSCP1901,110,"The Evil-Doer Warned",,,Beethoven,,"[O mighty man, why boast in sin]",alsace_beethoven,512333432543237,English,,
"Christian Science Hymnal","Kingdoms and thrones to God belong","Kingdoms and thrones to God belong",kingdoms_and_thrones_to_god_belong,CSH1909,6,,,"Isaac Watts",Beethoven,,ALSACE,alsace_beethoven,512333432543237,English,,
"Christian Science Hymnal (Rev. and enl.)","Grace for today, O Love divine","Grace for today, O Love divine",grace_for_today_o_love_divine,CSH1932,S422,,,"Nemi Robertson","Ludwig van Beethoven",,ALSACE,alsace_beethoven,512333432543237,English,,
"Church Book: for the use of Evangelical Lutheran congregations","Jesus, Thy wandering sheep behold!","Jesus, Thy wandering sheep behold!",jesus_thy_wandering_sheep_behold,CBWM1872,287,,,"C. Wesley",,8.8.8.8,BONN,alsace_beethoven,512333432543237,English,,
"Church Book: for the use of Evangelical Lutheran congregations","God of my life, whose gracious power","God of my life, whose gracious power",god_of_my_life_whose_gracious_power,CBWM1872,426,,,"C. Wesley",,8.8.8.8,BONN,alsace_beethoven,512333432543237,English,,
"Church Hymnal, Mennonite: a collection of hymns and sacred songs suitable for use in public worship, worship in the home, and all general occasions (1st ed. ) [with Deutscher Anhang]","My God, How Endless is Thy Love","My God, how endless is thy love",my_god_how_endless_is_thy_love,CHMC1927,27,"My God, How Endless is Thy Love",,"Isaac Watts",,8.8.8.8,ALSACE,alsace_beethoven,512333432543237,English,,"arr. From Ludwig van Beethoven, 1770-1827"
"Church Hymnal, Mennonite: a collection of hymns and sacred songs suitable for use in public worship, worship in the home, and all general occasions (40th ed.)","My God, How Endless is Thy Love","My God, how endless is thy love",my_god_how_endless_is_thy_love,CHMC2017,27,"My God, How Endless is Thy Love",,"Isaac Watts",,8.8.8.8,ALSACE,alsace_beethoven,512333432543237,English,,"arr. From Ludwig van Beethoven, 1770-1827"
"College Hymnal: a selection of Christian praise-songs for the uses of worship in universities, colleges and advanced schools.","Strong Son of God, Immortal Love","Strong Son of God, Immortal Love",strong_son_of_god_immortal_love,CHSC1897,190,,,"Alfred Tennyson","Ludwig van Beethoven",,ALSACE,alsace_beethoven,512333432543237,English,,
"College Hymnal: a selection of Christian praise-songs for the uses of worship in universities, colleges and advanced schools.","O love of God, how strong and true!","O love of God, how strong and true!",o_love_of_god_how_strong_and_true,CHSC1897,191,,,"Horatius Bonar","Ludwig van Beethoven",,ALSACE,alsace_beethoven,512333432543237,English,,
"High School Hymnal: a collection of Psalms and Hymns for the use of High Schools and Seminaries","O God, whose presence glows in all","O God, whose presence glows in all",o_god_whose_presence_glows_in_all,HSH1899,29,,,"Rev. N. L. Frothingham",Beethoven,,BEETHOVEN,alsace_beethoven,512333432543237,English,,
"High School Hymnal: a collection of Psalms and Hymns for the use of High Schools and Seminaries","O Thou who sendest sun and rain","O Thou who sendest sun and rain",o_thou_who_sendest_sun_and_rain,HSH1899,30,,,Anon.,Beethoven,,BEETHOVEN,alsace_beethoven,512333432543237,English,,
"Hymns of Grace and Truth","Father! In Thine Eternal Power","Father! in Thine eternal power",father_in_thine_etenal_power_thy_grace,HoGT1903,73,"Father! In Thine Eternal Power",,"J. N. Darby",Beethoven,,ETHELBERG,alsace_beethoven,512333432543237,English,,
"Hymns of the Kingdom of God","O Light of life, O Saviour dear","O Light of life, O Saviour dear",o_light_of_life_o_savior_dear,HoKo1923,326,,,"Francis T. Palgrave","Ludwig van Beethoven",,ALSACE,alsace_beethoven,512333432543237,English,,
"Hymns of the Kingdom of God","O Light of life, O Saviour dear","O Light of life, O Saviour dear",o_light_of_life_o_savior_dear,HoKo1926,326,,,"Francis T. Palgrave","Ludwig van Beethoven",,ALSACE,alsace_beethoven,512333432543237,English,,
"Magnificat: a Hymnal for Sunday Schools","Tis Thine To-Day","Just for today He giveth light",just_for_today_he_giveth_light,MHSS1923,63,"Tis Thine To-Day","For today He's providing","Grace Gordon","Alfred Judson",,"[Just for today He giveth light]",alsace_beethoven,512333432543237,English,,"From Beethoven's 2d Symphony"
"Methodist Hymn and Tune Book: official hymn book of the Methodist Church","A band of hard-pressed men are we","A band of hard-pressed men are we",a_band_of_hard_pressed_men_are_we,MHTB1917,365,,,"Edwin Gilbert, 1859-","Beethoven, 1770-1827",,ALSACE,alsace_beethoven,512333432543237,English,,
"New Manual of Praise: for Sabbath and Social Worship","O love divine, that stooped to share","O love divine, that stooped to share",o_love_divine_that_stooped_to_share,NMPS1901,373,,,"O. W. Holmes",Beethoven,,ETHELBERG,alsace_beethoven,512333432543237,English,,
"New Manual of Praise: for Sabbath and Social Worship","Thou only Sovereign of my heart","Thou only Sovereign of my heart",thou_only_sovereign_of_my_heart,NMPS1901,374,,,"Mrs. Steele",Beethoven,,ETHELBERG,alsace_beethoven,512333432543237,English,,
"New Manual of Praise: for Sabbath and Social Worship","We bid thee welcome in the name","We bid thee welcome in the name",we_bid_thee_welcome_in_the_name,NMPS1901,501,,,"J. Montgomery",Beethoven,,ETHELBERG,alsace_beethoven,5(1)23335(4)3225(4)3,English,,
"Praise and Service Songs for Sunday Schools","'Tis Thine Today","Just for today He giveth light",just_for_today_he_giveth_light,PSSS1927,107,"'Tis Thine Today","For today He's providing","Grace Gordon","Beethoven; Alfred Judson",,"[Just for today He giveth light]",alsace_beethoven,512333432543237,English,,
"Praise and Thanks: a hymn book for the Young People's Christian Union of the Universalist Church (Nos. 1 and 2 combined)","O God, whose presence glows in all","O God, whose presence glows in all",o_god_whose_presence_glows_in_all,PT121913,B2-13,,,"N. L. Frothingham",Beethoven,,"[O God, whose presence glows in all]",alsace_beethoven,512333432543237,English,,
"School and College Hymnal: a collection of hymns and of selections for responsive readings","O God, whose presence glows in all","O God, whose presence glows in all",o_god_whose_presence_glows_in_all,SCH1906,29,,,"Rev. N. L. Frothingham",Beethoven,,BEETHOVEN,alsace_beethoven,5123334332543237165,English,,
"School and College Hymnal: a collection of hymns and of selections for responsive readings","O thou who sendest sun and rain","O thou who sendest sun and rain",o_thou_who_sendest_sun_and_rain,SCH1906,30,,,Anon.,Beethoven,,BEETHOVEN,alsace_beethoven,512333432543237,English,,
"Song-Hymnal of Praise and Joy: a selection of spiritual songs, old and new","Work On, my Soul","Work on my soul with voice and hand",work_on_my_soul_with_voice_and_hand,SHPJ1924,309,"Work On, my Soul",,"Elinor Hiscock",Beethoven,,ALSACE,alsace_beethoven,512333432543237,English,,
"Song-Hymnal of Praise and Joy: a selection of spiritual songs, old and new","It matters not so very much","It matters not so very much",it_matters_not_so_very_much,SHPJ1924,310,,,"Clara E. Choate",Beethoven,,ALSACE,alsace_beethoven,512333432543237,English,,
"Songs Celestial","O Son of God","How beauteous were the marks divine",how_beauteous_were_the_marks_divine,SC1889,25,"O Son of God",,"Rev. A. C. Coxe",Beethoven,,"[How beauteous were the marks divine]",alsace_beethoven,512335432543237165,English,,
"Songs for the Lord's House","We've no abiding city here","We've no abiding city here",weve_no_abiding_city_here,S4LH1880,427,,,"Thomas Kelly",Beethoven,,BEETHOVEN,alsace_beethoven,512333432543237,English,,
"The A.M.E. Zion Hymnal: official hymnal of the African Methodist Episcopal Zion Church","O Lord of Hosts, Whose Glory Fills","O Lord of hosts, whose glory fills",o_lord_of_hosts_whose_glory_fills,AMEZ1996,375,"O Lord of Hosts, Whose Glory Fills",,"John M Neale, 1818-1866","Ludwig van Beethoven, 1770-1827",8.8.8.8,ALSACE,alsace_beethoven,512333432543237,English,,
"The A.M.E. Zion Hymnal: official hymnal of the African Methodist Episcopal Zion Church","On Earth, Ere Christ the Lord Appeared","On earth, ere Christ the Lord appeared",on_earth_ere_christ_the_lord_appeared,AMEZ1996,376,"On Earth, Ere Christ the Lord Appeared",,"John J Moore","Ludwig van Beethoven, 1770-1827",8.8.8.8,ALSACE,alsace_beethoven,512333432543237,English,,
"The Academic Hymnal","God, in the gospel of his Son","God, in the gospel of his Son",god_in_the_gospel_of_his_son,AH1899,214,,,"B. Beddome; T. Cotterill","L. van Beethoven (1770-1827)",8.8.8.8,BEETHOVEN,alsace_beethoven,512333432543237,,,
"The Academic Hymnal","Take up thy cross, the Saviour said","Take up thy cross, the Saviour said",take_up_thy_cross_the_savior_said_if_tho,AH1899,215,,,"C. W. Everest","L. van Beethoven (1770-1827)",,BEETHOVEN,alsace_beethoven,512333432543237,,,
"The Book of Praise for Church, School and Home: Selections from the Prayer Book and Hymnal","Lord Jesus! when we stand afar","Lord Jesus! when we stand afar",lord_jesus_when_we_stand_afar,BPCS1893,67,,,"A. Fortunatus",Beethoven,,ALSACE,alsace_beethoven,512333432543237,English,,
"The Book of Praise for Sunday Schools: Selections from the Revised Prayer Book and Hymnal","Lord Jesus! when we stand afar","Lord Jesus! when we stand afar",lord_jesus_when_we_stand_afar,BPSS1893,67,,,"A. Fortunatus",Beethoven,,ALSACE,alsace_beethoven,512333432543237,English,,
"The Church Hymnal: containing hymns approved and set forth by the general conventions of 1892 and 1916; together with hymns for the use of guilds and brotherhoods, and for special occasions (Rev. ed)","All things are Thine; no gift have we","All things are Thine; no gift have we",all_things_are_thine_no_gift_have_we,CHRC1920,290,,,"J. G. Whittier","From L. van Beethoven",,ALSACE,alsace_beethoven,512333432543237,English,,
"The Coronation Hymnal: a selection of hymns and songs","O God! Thou art my God alone","O God! Thou art my God alone",o_god_thou_art_my_god_alone_early_to,CH1894,16,,,"James Montgomery",Beethoven,,ETHELBERG,alsace_beethoven,512333432543237,English,,
"The Cyber Hymnal","How Shall I Follow Him I Serve?","How shall I follow Him I serve?",how_shall_i_follow_him_i_serve,CYBER,2611,"How Shall I Follow Him I Serve?",,"Josiah Conder","Ludwig van Beethoven, 1770-1827",8.8.8.8,ALSACE,alsace_beethoven,512334325432371,English,"<cite>Star in the East</cite> (London: 1824)",
"The Cyber Hymnal","When Jesus Dwelt in Mortal Clay","When Jesus dwelt in mortal clay",when_jesus_dwelt_in_mortal_clay,CYBER,7545,"When Jesus Dwelt in Mortal Clay",,"Thomas Gibbons","Ludwig van Beethoven, 1770-1827",8.8.8.8,ALSACE,alsace_beethoven,512334325432371,English,"<cite>Hymns Adapted to Divine Worship</cite>, 1784",
"The Cyber Hymnal","Viens, Oh! Viens, Seigneur!","Viens, oh! viens, Seigneur!",viens_o_viens_seigneur,CYBER,14118,"Viens, Oh! Viens, Seigneur!",,"Henri L. Rossier, 1835-1928","Ludwig van Beethoven",,"[Viens, oh! viens, Seigneur]",alsace_beethoven,55123334322254322377,French,,
"The Fellowship Hymn Book","A Band of Hard-Pressed Men","A band of hard-pressed men are we",a_band_of_hard_pressed_men_are_we,FHB1908,19,"A Band of Hard-Pressed Men",,"Edwin Gilbert",Beethoven,,ALSACE,alsace_beethoven,512333432543237,English,,
"The Hymnal : published in 1895 and revised in 1911 by authority of the General Assembly of the Presbyterian Church in the United States of America : with the supplement of 1917","Again, as evening's shadow falls","Again, as evening's shadow falls",again_as_evenings_shadow_falls,THEH,23,,,"Samuel Longfellow","Ludwig van Beethoven",8.8.8.8,ALSACE,alsace_beethoven,512333432543237,English,,
"The Hymnal : published in 1895 and revised in 1911 by authority of the General Assembly of the Presbyterian Church in the United States of America : with the supplement of 1917","Savior, when night involves the skies","Savior, when night involves the skies",savior_when_night_involves_the_skies,THEH,145a,,,"Thomas Gisborne","Ludwig van Beethoven",8.8.8.8,ALSACE,alsace_beethoven,512333432543237,English,,
"The Hymnal : published in 1895 and revised in 1911 by authority of the General Assembly of the Presbyterian Church in the United States of America : with the supplement of 1917","How shall I follow Him I serve?","How shall I follow Him I serve?",how_shall_i_follow_him_i_serve,THEH,206a,,,"Josiah Conder","Ludwig van Beethoven",8.8.8.8,ALSACE,alsace_beethoven,512333432543237,English,,
"The Hymnal for Boys and Girls","Hearts Like Doors Will Open With Ease","Hearts like doors will open with ease",hearts_like_doors_will_open_with_ease,H4BG1935,114,"Hearts Like Doors Will Open With Ease",,Anonymous,"Ludwig van Beethoven",8.8.8.8,LARGHETTO,alsace_beethoven,512333432543237,,,"Second Symphony"
"The Hymnal of Praise","Grant us thy light, that we may know","Grant us thy light, that we may know",o_grant_us_light_that_we_may_know,HoP1913,354,,,"Lawrence Tuttiett","Ludwig van Beethoven (1770-1827)",,HOPKINS,alsace_beethoven,512333432543237,,,
"The Methodist Hymnal: Official hymnal of the methodist episcopal church and the methodist episcopal church, south","My Lord, how full of sweet content","My Lord, how full of sweet content",my_lord_how_full_of_sweet_content,MHOH1905,518,,,"William Cowper; Madame Guyon","Ludwig van Beethoven",,ALSACE,alsace_beethoven,512333432543237,English,,
"The Methodist Hymnal: Official hymnal of the methodist episcopal church and the methodist episcopal church, south","O Lord of hosts, whose glory fills","O Lord of hosts, whose glory fills",o_lord_of_hosts_whose_glory_fills,MHOH1905,658,,,"John M. Neale","Ludwig van Beethoven",,ALSACE,alsace_beethoven,512333432543237,English,,
"The Methodist Hymnal: Official hymnal of the methodist episcopal church and the methodist episcopal church, south","When Jesus dwelt in mortal clay","When Jesus dwelt in mortal clay",when_jesus_dwelt_in_mortal_clay,MHOH1905,695,,,"Thomas Gibbons","Ludwig van Beethoven",,ALSACE,alsace_beethoven,512333432543237,English,,
"The National Hymn Book of the American Churches: comprising the hymns which are common to the hymnaries of the Baptists, Congregationalists, Episcopalians, Lutherans, Methodists, Presbyterians...","Dread Jehovah! God of nations!","Dread Jehovah! God of nations!",dread_jehovah_god_of_nations,NHBA1893,107,,,"C. F. ",,,DRESDEN,alsace_beethoven,512333432543237,,,German
"The New Laudes Domini: a selection of spiritual songs, ancient and modern for use in Baptist churches","Sweet is the light of Sabbath eve","Sweet is the light of Sabbath eve",sweet_is_the_light_of_sabbath_eve,NLD1892,109,,,"James Edmeston",Beethoven,,ALSACE,alsace_beethoven,512333432543237,English,,
"The Pilgrim Hymnal","O God, whose presence glows in all","O God, whose presence glows in all",o_god_whose_presence_glows_in_all,PH1904,13,,,"Nathaniel L. Frothingham","Ludwig von Beethoven (1770-1827)",,ALSACE,alsace_beethoven,512333432543237,English,,
"The Pilgrim Hymnal","Hath not thy heart within thee burned","Hath not thy heart within thee burned",hath_not_thy_heart_within_thee_burned,PH1904,507,,,"Stephen G. Bulfinch","Beethoven (1770-1827)",,ALSACE,alsace_beethoven,512333432543237,English,,
"The Praise Hymnal: a collection of hymns and tunes","O God, Thou art my God alone","O God, Thou art my God alone",o_god_thou_art_my_god_alone_early_to,PH1896,74,,,Montgomery,Beethoven,,ETHELBERG,alsace_beethoven,512333432543237,English,,
"The Primitive Methodist Church Hymnal: containing also selections from scripture for responsive reading","The royal banners forward go","The royal banners forward go",the_royal_banners_forward_go,PMCH1902,166,,,"V. Fortunatus; J. M. Neale",Beethoven,,ALSACE,alsace_beethoven,512333432543237,English,,
"The School Hymnal: a book of worship for young people","Grant us Thy light, that we may know","Grant us Thy light, that we may know",o_grant_us_light_that_we_may_know,SH1920,161,,,"Lawrence Tuttiett","Ludwig von Beethoven, (1770-1827)",,HOPKINS,alsace_beethoven,512333432543237,English,,
"The Tribute of Praise and Methodist Protestant Hymn Book","How blest the sacred tie that binds","How blest the sacred tie that binds",how_blest_the_sacred_tie_that_binds,TPMP1882,706,,,,Beethoven,,DRESDEN,alsace_beethoven,512333432543237,English,,
"The Tribute of Praise: a collection of hymns and tunes for public and social worship, and for the use in the family circle and Sabbath school","How blest the sacred tie that binds","How blest the sacred tie that binds",how_blest_the_sacred_tie_that_binds,ToP1873,706,,,,Beethoven,,DRESDEN,alsace_beethoven,512333432543237,,,
"The Woman's Hymnal: a collection of sacred lyrics set to music and arranged as duets for soprano and alto, (tenor and bass ad libitum.) for the use of The Woman's College of Baltimore","New every morning is the love","New every morning is the love",new_every_morning_is_the_love,WH1892,27,,,"Rev. John Keble, 1792-1866","L. v. Beethoven (1770-1827)",,"ST. HELEN",alsace_beethoven,512333432543237,English,,
"Trinity Hymnal","High in the heavens, eternal God","High in the heavens, eternal God",high_in_the_heavens_eternal_god,TH1961,52,,,"Isaac Watts","Ludwig van Beethoven, 1770-1827",8.8.8.8,ALSACE,alsace_beethoven,512333432543237,English,,
"Voices Together","When Hands Reach Out","When hands reach out and fingers trace",when_hands_reach_out_and_fingers_trace,VT2020,513,"When Hands Reach Out",,"Carolyn Winfrey Gillette","Ludwig van Beethoven",8.8.8.8,ALSACE,alsace_beethoven,512333432543237,,,"adapt. from Symphony no. 2, 1802"
