hymnalTitle,displayTitle,firstLine,textAuthNumber,hymnalID,number,textTitle,refrainFirstLine,authors,composers,meter,tuneTitle,tuneAuthNumber,incipit,languages,textSources,tuneSources
"Celestial Songs: a collection of 900 choice hymns and choruses, selected for all kinds of Christian Getherings, Evangelistic Word, Solo Singers, Choirs, and the Home Circle","He Saves Me Through and Through","The blood that Jesus shed for me",the_blood_that_jesus_shed_for_me_when_gr,CS1921,228,"He Saves Me Through and Through","Sav'd, sav'd, yes, I am sav'd","Fanny J. Crosby","Jno. R. Sweney",,"[The blood that Jesus shed for me]",the_blood_that_jesus_shed_for_sweney,555535123552234,English,,
"Golden Songs of Glory","He Saves Me Through and Through","The blood which Jesus shed for me",the_blood_that_jesus_shed_for_me_when_gr,GSG1906,124,"He Saves Me Through and Through","He saves me through and through","Chas. Edw. Pollock","Chas. Edw. Pollock",,"[The blood which Jesus shed for me]",the_blood_which_jesus_shed_pollock,13543216512334321234,English,,
"Gospel Tent Hymns","Saved, saved, yes, I am saved","The blood that Jesus shed for me",the_blood_that_jesus_shed_for_me_when_gr,GTH1889,99,,"Saved, saved, yes, I am saved",,,,,,,English,,
"Gospel Tent Hymns","He saves me through and through","The blood that Jesus shed for me",the_blood_that_jesus_shed_for_me_when_gr,GTH1890,d165,"He saves me through and through","Saved, saved, yes, I am saved","Fanny J. Crosby",,,,,,English,,
"Joy, for use in Sunday School and Gospel Meetings","Saved through and through","The blood which Jesus shed for me",the_blood_that_jesus_shed_for_me_when_gr,JSSG1894,d85,"Saved through and through","Yes, Jesus died upon the tree","Fanny J. Crosby",,,,,,English,,
"Selection of Hymns, for the use of the first M. E. Church, Cape May City","He Saves Me Through and Through","The blood that Jesus shed for me",the_blood_that_jesus_shed_for_me_when_gr,SHME1887,54,"He Saves Me Through and Through","Sav'd, sav'd, yes, I am sav'd",,,,,,,,,
"Songs of Joy and Gladness","He Saves Me Through and Through","The blood that Jesus shed for me",the_blood_that_jesus_shed_for_me_when_gr,SoJG1885,208,"He Saves Me Through and Through","Sav'd, sav'd, yes, I am sav'd","Fanny J. Crosby","Jno. R. Sweney",,"[The blood that Jesus shed for me]",the_blood_that_jesus_shed_for_sweney,555535123552234,English,,
"Songs of Joy and Gladness with Supplement","He Saves Me Through and Through","The blood that Jesus shed for me",the_blood_that_jesus_shed_for_me_when_gr,SJGS1889,208,"He Saves Me Through and Through","Sav'd, sav'd, yes, I am sav'd","Fanny J. Crosby","Jno. R. Sweney",,"[The blood that Jesus shed for me]",the_blood_that_jesus_shed_for_sweney,555535123552234,English,,
"The Best of All: complete","He Saves me Through and Through","The blood that Jesus shed for me",the_blood_that_jesus_shed_for_me_when_gr,BoAC1910,29,"He Saves me Through and Through","Sav'd, sav'd, yes, I am sav'd","Fanny J. Crosby","Jno. R. Sweney",,"[The blood that Jesus shed for me]",the_blood_that_jesus_shed_for_sweney,555535123552234,,,
"The Cyber Hymnal","He Saves Me Through and Through","The blood that Jesus shed for me",the_blood_that_jesus_shed_for_me_when_gr,CYBER,2617,"He Saves Me Through and Through","Saved, saved, yes, I am saved","Frances Jane (Fanny) Crosby","John Robson Sweney",,"[The blood that Jesus shed for me]",the_blood_that_jesus_shed_for_sweney,555535123552234,English,,
"The Revival Wave: A Book of Revival Hymns and Music","Saves me Through and Through","The blood that Jesus shed for me",the_blood_that_jesus_shed_for_me_when_gr,RW1887,87,"Saves me Through and Through","Saved, saved, yes, I am saved","Fanny J. Crosby","Jno. R. Sweney",,"[The blood that Jesus shed for me]",the_blood_that_jesus_shed_for_sweney,555535123552234,English,,
