hymnalTitle,displayTitle,firstLine,textAuthNumber,hymnalID,number,textTitle,refrainFirstLine,authors,composers,meter,tuneTitle,tuneAuthNumber,incipit,languages,textSources,tuneSources
"A Choice Collection of Hymns, and Spiritual Songs, designed for the devotions of Israel, in prayer, conference, and camp-meetings...(2nd ed.)","Praise God, from whom all blessings flow","Praise God, from whom all blessings flow",praise_god_from_whom_all_blessings_ken,CCHS1831,148,,,,,,,,,English,,
"A Collection of Hymns and Sacred Songs: suited to both private and public devotions, and especially adapted to the wants and uses of the brethren of the Old German Baptist Church","Praise God from whom all blessings flow","Praise God from whom all blessings flow",praise_god_from_whom_all_blessings_ken,CHSS1882,349,,,,,,,,,English,,
"A Collection of Hymns for Public, Social, and Domestic Worship","Praise God from whom all blessings flow","Praise God from whom all blessings flow",praise_god_from_whom_all_blessings_ken,CHPS1866,1054,,,,,,,,,English,,
"A Collection of Hymns for the use of the African Methodist Episcopal Zion Church in America","Praise God, from whom all blessings flow","Praise God, from whom all blessings flow",praise_god_from_whom_all_blessings_ken,ACOH1872,1130,,,,,8.8.8.8,,,,English,,
"A Collection of Hymns for the Use of the Methodist Episcopal Church: principally from the collection of  Rev. John Wesley, M. A., late fellow of Lincoln College, Oxford; with... (Rev. & corr.)","Praise God, from whom all blessings flow","Praise God, from whom all blessings flow",praise_god_from_whom_all_blessings_ken,CHUM1836,606,,,,,,,,,English,,
"A Collection of Hymns for the Use of the Methodist Episcopal Church: Principally from the Collection of the Rev. John Wesley. M. A.","Praise God, from whom all blessings flow","Praise God, from whom all blessings flow",praise_god_from_whom_all_blessings_ken,CHUM1821,606,,,,,,,,,English,,
"A Collection of Hymns, for the Christian Church and Home","Praise God, from whom all blessings flow","Praise God, from whom all blessings flow",praise_god_from_whom_all_blessings_ken,CHCC1843,A2,,,Anonymous,,8.8.8.8,,,,English,,
"A Collection of Hymns, for the use of the United Brethren in Christ: taken from the most approved authors, and adapted to public and private worship","Praise God, from whom all blessings flow!","Praise God, from whom all blessings flow!",praise_god_from_whom_all_blessings_ken,CHUU1858,1070,,,,,,,,,English,,
"A Collection of Hymns: for the use of the Methodist Episcopal Church, principally from the collection of the Rev. John Wesley, A. M., late fellow of Lincoln College..(Rev. and corr. with a supplement)","Praise God, from whom all blessings flow","Praise God, from whom all blessings flow",praise_god_from_whom_all_blessings_ken,CHUM1845,606,,,,,,,,,English,,
"A Collection of Hymns: Supplementary to the Psalms and Hymns of Dr. Watts","Praise God, from whom all blessings flow!","Praise God, from whom all blessings flow!",praise_god_from_whom_all_blessings_ken,CHSP1859,D1,,,,,,,,,English,,
"A Collection of Psalms and Hymns for Public Worship","Praise God, from whom all blessings flow","Praise God, from whom all blessings flow",praise_god_from_whom_all_blessings_ken,CPHP1805,LXIII,,,,,,,,,English,,
"A Collection of Psalms and Hymns: from various authors, chiefly designed for public worship (4th ed.)","Praise God, from whom all blessings flow","Praise God, from whom all blessings flow",praise_god_from_whom_all_blessings_ken,CPHF1811,142c,,,,,,,,,English,,
"A Collection of Sabbath School Hymns: compiled by a Sabbath School Teacher",Doxology,"Praise God, from whom all blessings flow",praise_god_from_whom_all_blessings_ken,CSSH1863,70,Doxology,,,,,,,,English,,
"A Collection of Sacred Hymns for the Church of Jesus Christ of Latter-Day  Saints","Praise God, from whom all blessings flow","Praise God, from whom all blessings flow",praise_god_from_whom_all_blessings_ken,CSHC1845,181,,,,,8.8.8.8,,,,English,,
"A Collection of Sacred Hymns, for the Church of Jesus Christ of Latter Day Saints","Praise God from Whom all blessings flow","Praise God from Whom all blessings flow",praise_god_from_whom_all_blessings_ken,CSHC1841,303,,,,,8.8.8.8,,,,English,,
"A Manual of Devotion and Hymns for the House of Refuge, City of New York","Praise God, from whom all blessings flow","Praise God, from whom all blessings flow",praise_god_from_whom_all_blessings_ken,MDHH1869,423,,,,,,,,,English,,
"A Manual of Worship: for the chapel of Girard College","Praise God, from whom all blessings flow","Praise God, from whom all blessings flow",praise_god_from_whom_all_blessings_ken,MWCG1903,260a,,,"Thomas Ken (1637-1711)",,,,,,English,,
"A New Selection of Nearly Eight Hundred Evangelical Hymns, from More than  200 Authors in England, Scotland, Ireland, & America, including a great number of originals, alphabetically arranged","Praise God, from whom all blessings flow","Praise God, from whom all blessings flow",praise_god_from_whom_all_blessings_ken,NSNE1825,688,,,Kenn,,,,,,English,,
"A New Selection of Psalms, Hymns and Spiritual Songs: from the best authors; designed for the use of conference meetings, private circles, and congregations (21st ed. with an appendix)","Praise God, from whom all blessings flow","Praise God, from whom all blessings flow",praise_god_from_whom_all_blessings_ken,NSPH1839,520,,,,,,,,,English,,
"A New Selection of Seven Hundred Evangelical Hymns ... intended as a        Supplement to Dr. Watts's Psalms and Tunes","Praise God, from whom all blessings flow","Praise God, from whom all blessings flow",praise_god_from_whom_all_blessings_ken,NSSH1810,688,,,Kent,,8.8.8.8,,,,English,,
"A Pastor's Selection of Hymns and Tunes: for Worship in the Church and Family","Praise God from whom all blessings flow","Praise God from whom all blessings flow",praise_god_from_whom_all_blessings_ken,PSHT1859,D1,,,,,,,,,English,,
"A Selection of Hymns & Psalms: from the most approved authors: principally from Watts & Rippon: together with originals","Praise God, from whom all blessings flow","Praise God, from whom all blessings flow",praise_god_from_whom_all_blessings_ken,SHPF1808,433,,,,,,,,,English,,
"A Selection of Hymns for Public Worship. In four parts (10th ed.) (Gadsby's Hymns)","Praise God, from whom all blessings flow","Praise God, from whom all blessings flow",praise_god_from_whom_all_blessings_ken,SHPW1844,506b,,,"Bishop Kenn",,8.8.8.8,,,,English,,
"A Selection of Hymns for Worship (2nd ed.)","Praise God, from whom all blessings flow","Praise God, from whom all blessings flow",praise_god_from_whom_all_blessings_ken,SHW1825,427,,,,,,,,,English,,
"A Selection of Hymns from the Best Authors, intended to be an Appendix to  Dr. Watts' Psalms & Hymns. 2nd Baltimore ed.","Praise God, from whom all blessings flow","Praise God, from whom all blessings flow",praise_god_from_whom_all_blessings_ken,SHBA1804,aCCCXCV,,,,,,,,,,,
"A Selection of Hymns from the Best Authors.: including a great number of originals: intended to be an appendix to Dr. Watts's Psalms and Hymns. (Woodward's rev. and corr. ed.; Sterotype ed.)","Praise God, from whom all blessings flow","Praise God, from whom all blessings flow",praise_god_from_whom_all_blessings_ken,SHBA1819,395,,,,,,,,,English,,
"A Selection of Hymns: designed as a supplement to the ""psalms and hymns"" of the Presbyterian church","Praise God, from whom all blessings flow","Praise God, from whom all blessings flow",praise_god_from_whom_all_blessings_ken,SHDS1861,D4,,,,,,,,,English,,
"A Selection of Hymns: from the best authors, intended to be an appendix to Dr. Watt's psalms and hymns. (1st Am. ed.)","Praise God, from whom all blessings flow","Praise God, from whom all blessings flow",praise_god_from_whom_all_blessings_ken,SHBA1792,CCCXCV,,,"Bp. Kem",,8.8.8.8,,,,English,,
"A Selection of Spiritual Songs: with music for the Church and the Choir","Praise God, from whom all blessings flow!","Praise God, from whom all blessings flow!",praise_god_from_whom_all_blessings_ken,SoSS1878,D1,,,,,,,,,English,,
"A Selection of Spiritual Songs: with music for the Church and the Choir","Praise God, from whom all blessings flow","Praise God, from whom all blessings flow",praise_god_from_whom_all_blessings_ken,SoSS1878,80,,,"T. Ken",,,,,,English,,
"A Selection of Spiritual Songs: with music for the Church and the Choir","Praise God from whom all blessings flow","Praise God from whom all blessings flow",praise_god_from_whom_all_blessings_ken,SoSS1878,144,,,,,,,,,English,,
"A Service Book: with a selection of tunes and hymns for Sabbath schools (6th ed.)","Closing Hymn","Praise God, from whom all blessings flow!",praise_god_from_whom_all_blessings_ken,SB1854,207b,"Closing Hymn",,,,,,,,English,,
"A Teaching Hymnal: ecumenical and evangelical","Praise God, from Whom All Blessings Flow","Praise God, from whom all blessings flow",praise_god_from_whom_all_blessings_ken,ATH2018,106,"Praise God, from Whom All Blessings Flow",,"Thomas Ken, 1637-1711","Louis Bourgeois, 1510-1559",,"OLD 100th",old_hundredth_bourgeois,117651233332143,English,,
"A. M. E. C. Hymnal",Doxology,"Praise God, from whom all blessings flow",praise_god_from_whom_all_blessings_ken,AMEC1954,297a,Doxology,,,,8.8.8.8,,,,English,,
"A. M. E. C. Hymnal",Doxology,"Praise God, from whom all blessings flow",praise_god_from_whom_all_blessings_ken,AMEC1954,411a,Doxology,,,,8.8.8.8,,,,English,,
"A. M. E. C. Hymnal","Praise God, from Whom All Blessings Flow","Praise God, from whom all blessings flow",praise_god_from_whom_all_blessings_ken,AMEC1954,600,"Praise God, from Whom All Blessings Flow",,"Thomas Ken","Louis Bourgeois",,"THE OLD HUNDREDTH",old_hundredth_bourgeois,117651233332143,English,,"Genevan Psalter"
"Additional Hymns, Adopted by the General Synod of the Reformed Dutch Church  in North America, at their Session June 1831. 2nd ed.","Praise God from whom all blessings flow","Praise God from whom all blessings flow",praise_god_from_whom_all_blessings_ken,AHAG1831,D2,,,,,,,,,English,,
"Additional Hymns, Adopted by the General Synod of the Reformed Protestant Dutch Church in North America, at their Session, June 1846, and authorized to be used in the churches under their care","Praise God from whom all blessings flow","Praise God from whom all blessings flow",praise_god_from_whom_all_blessings_ken,AHAG1846,D2,,,,,,,,,English,,
"African American Heritage Hymnal","Praise God from Whom All Blessings Flow","Praise God from whom all blessings flow",praise_god_from_whom_all_blessings_ken,AAHH2001,650,"Praise God from Whom All Blessings Flow",,"Isaac Watts, 1675-1748; William Keathe, d. 1593; Thomas Ken, 1637-1711","John Hatton, d. 1793; George Coles; Roberta Martin, 1912-1969",,"[Praise God from whom all blessings flow]",praise_god_from_whom_all_blessing_martin,13456717651345543213,English,,
"African American Heritage Hymnal",Doxology,"Praise God from whom all blessings flow",praise_god_from_whom_all_blessings_ken,AAHH2001,651,Doxology,,"Thomas Ken, 1637-1711","Louis Bourgeois, 1510-1561",8.8.8.8,"OLD 100TH",old_hundredth_bourgeois,117651233332143,English,,"<cite>Genevan Psalter</cite>, 1551"
"African Methodist Episcopal Church Hymnal","Praise God! (Doxology) (SATB)","Praise God, from Whom all blessings flow",praise_god_from_whom_all_blessings_ken,AMEC1984,593,"Praise God! (Doxology) (SATB)",,,"Lowell Mason, 1792-1872",,"[Praise God, from Whom all blessings flow]",dedication_anthem_stanley,1113323423567123432,English,,
"African Methodist Episcopal Church Hymnal","Praise God, from Whom All Blessings Flow (Doxology)","Praise God, from whom all blessings flow",praise_god_from_whom_all_blessings_ken,AMEC1984,647,"Praise God, from Whom All Blessings Flow (Doxology)",,"Thomas Ken, 1637-1711","Louis Bourgeois, c. 1510-c.1561",8.8.8.8,"OLD 100TH",old_hundredth_bourgeois,117651233332143,English,,"<cite>Genevan Psalter</cite>, 1551"
"African Methodist Episcopal hymn and tune book: adapted to the doctrine and usages of the church.","Praise God from whom all blessing flow","Praise God from whom all blessing flow",praise_god_from_whom_all_blessings_ken,AMEH1898,114a,,,,,8.8.8.8,REST,rest_bradbury,555155324442767,English,,
"African Methodist Episcopal hymn and tune book: adapted to the doctrine and usages of the church.","Praise God from whom all blessings flow","Praise God from whom all blessings flow",praise_god_from_whom_all_blessings_ken,AMEH1898,273a,,,,"Wm. B. Bradbury",8.8.8.8,REST,rest_bradbury,555155324442767,English,,
"African Methodist Episcopal hymn and tune book: adapted to the doctrine and usages of the church.","Praise God, from whom all blessings flow","Praise God, from whom all blessings flow",praise_god_from_whom_all_blessings_ken,AMEH1898,289a,,,,"J. Hatton",8.8.8.8,"DUKE STREET",duke_street_hatton,134567176555565,English,,
"African Methodist Episcopal hymn and tune book: adapted to the doctrine and usages of the church.","Praise God, from whom all blessings flow","Praise God, from whom all blessings flow",praise_god_from_whom_all_blessings_ken,AMEH1898,613a,,,"T. Ken",,8.8.8.8,REST,rest_bradbury,555155324442767,English,,
"Alleluia: a hymnal for use in schools, in the home, in young people's societies in devotional meetings",Doxology,"Praise God from whom all blessings flow",praise_god_from_whom_all_blessings_ken,AHUS1916,1b,Doxology,,"Bishop Thomas Ken",,,,,,English,,
"Ambassador Hymnal: for Lutheran worship","Praise God, from Whom All Blessings Flow","Praise God, from whom all blessings flow",praise_god_from_whom_all_blessings_ken,AH1994,390,"Praise God, from Whom All Blessings Flow",,"Thomas Ken, 1637-1711","Louis Bourgeois, ca. 1510-1561",8.8.8.8,"OLD HUNDREDTH",old_hundredth_bourgeois,117651233332143,English,,
"American Church and Church School Hymnal: a new religious educational hymnal","Praise God, from whom all blessings flow","Praise God, from whom all blessings flow",praise_god_from_whom_all_blessings_ken,ACCS1927,377,,,"Thomas Ken","Louis Bourgeois",,"OLD HUNDREDTH",old_hundredth_bourgeois,117651233332143,English,,
"American Junior Church School Hymnal","Praise God, from whom all blessings flow","Praise God, from whom all blessings flow",praise_god_from_whom_all_blessings_ken,AJCS1929,17,,,"Thomas Ken","Louis Bourgeois",,"OLD HUNDREDTH",old_hundredth_bourgeois,117651233332143,English,,
"American Sunday School Hymn Book. 2nd ed.","Praise God, from whom all blessings flow!","Praise God, from whom all blessings flow!",praise_god_from_whom_all_blessings_ken,ASS1860,a451,,,,,,,,,English,,
"American Sunday School Hymn Book. New ed.","Praise God, from whom all blessings flow!","Praise God, from whom all blessings flow!",praise_god_from_whom_all_blessings_ken,ASS1860a,aa451,,,,,,,,,English,,
"Anglican Hymns Old and New (Rev. and Enl.)",Doxolgy,"Praise God, from whom all blessing flow",praise_god_from_whom_all_blessings_ken,HON2008,618,Doxolgy,,"Thomas Ken","Jimmy Owens",,"FAIRHILL (OWENS)",fairhill_owens,5123455654554,English,,
"Assembly Songs",Doxology,"Praise God, from whom all blessings flow",praise_god_from_whom_all_blessings_ken,AS1948,312,Doxology,,"Thos. Ken","Louis Bourgeois",,"[Praise God, from whom all blessings flow]",old_hundredth_bourgeois,117651233332143,English,,
"Assembly Songs: for use in evangelistic services, Sabbath schools, young peoples societies, devotional meetings, and the home",Doxolory,"Praise God, from whom all blessings flow",praise_god_from_whom_all_blessings_ken,ASUE1910,238,Doxolory,,"Thos. Ken","G. Frank",,"[Praise God, from whom all blessings flow]",old_hundredth_bourgeois,117651233332143,English,,
"Association Hymn Book: for use in meetings for men","Praise God, from whom all blessings flow","Praise God, from whom all blessings flow",praise_god_from_whom_all_blessings_ken,AHBU1904,1a,,,"Thomas Ken","L. Bourgeois",,"OLD HUNDREDTH",old_hundredth_bourgeois,117651233332143,English,,
"At Worship: a hymnal for young churchmen","Praise God from whom all blessings flow","Praise God from whom all blessings flow",praise_god_from_whom_all_blessings_ken,AW41951,R14,,,"Thomas Ken","Louis Bourgeois",,"OLD HUNDREDTH (Altered Rhythm)",old_hundredth_bourgeois,117651233332143,English,,
"Australian Hymn Book","Praise God, from whom all blessings flow","Praise God, from whom all blessings flow",praise_god_from_whom_all_blessings_ken,AHB,573,,,,,8.8.8.8,,,,English,,
"Baptist Hymn Book","Praise God, from whom all blessings flow","Praise God, from whom all blessings flow",praise_god_from_whom_all_blessings_ken,BHB1847,a870,,,,,,,,,English,,
"Baptist Hymnal",Doxology,"Praise God from whom all blessings flow",praise_god_from_whom_all_blessings_ken,BH1956,514,Doxology,,"Thomas Ken, 1637-1711",,8.8.8.8,"OLD 100th",old_hundredth_bourgeois,117651233332143,English,,"From the <i>Genevan Psalter,</i> 1551"
"Baptist Hymnal (1975 ed)","Praise God from whom All Blessings Flow","Praise God, from whom all blessings flow",praise_god_from_whom_all_blessings_ken,BH1975,6,"Praise God from whom All Blessings Flow",,"Thomas Ken",,,"OLD 100TH",old_hundredth_bourgeois,117651233332143,English,,"<cite>Genevan Psatler</cite>, 1551, alt"
"Baptist Hymnal (1975 ed)","Praise God from whom All Blessings Flow","Praise God, from whom all blessings flow",praise_god_from_whom_all_blessings_ken,BH1975,7,"Praise God from whom All Blessings Flow",,"Thomas Ken",,,"OLD 100TH",old_hundredth_bourgeois,117651233332143,English,,"<cite>Genevan Psatler</cite>, 1551, alt"
"Baptist Hymnal 1991","Praise God, from Whom All Blessings Flow","Praise God, from whom all blessings flow",praise_god_from_whom_all_blessings_ken,BH1991,253,"Praise God, from Whom All Blessings Flow",,"Thomas Ken","Louis Bourgeois",8.8.8.8,"OLD 100TH (altered)",old_hundredth_bourgeois,117651233332143,English,,"""Genevan Psalter,"" 1551"
"Baptist Hymnal 2008",Doxology,"Praise God, from whom all blessings flow",praise_god_from_whom_all_blessings_ken,BH2008,668,Doxology,,"Thomas Ken","Louis Bourgeois; David T. Clydesdale",8.8.8.8,"OLD 100TH (altered)",old_hundredth_bourgeois,117651233332143,English,,"<cite>Genevan Psalter</cite>, 1551 Edition"
"Beautiful Songs; a new and choice collection of songs for the sunday school. Also, a responsive service for each month in the year","Praise God, from whom all blessings flow","Praise God, from whom all blessings flow",praise_god_from_whom_all_blessings_ken,BS1887,s15,,,,,,,,,English,,
"Beginner and Primary Songs: for use in Sunday School and the Home",Doxology,"Praise God, from whom all blessings flow",praise_god_from_whom_all_blessings_ken,BPSS1915,130,Doxology,,,,,"OLD HUNDREDTH",old_hundredth_bourgeois,117651233332143,English,,
"Best Hymns No. 3: for services of song in Christian work","Praise God from whom all blessings flow","Praise God from whom all blessings flow",praise_god_from_whom_all_blessings_ken,BH31903,181,,,"Thos. Ken","G. Franc",,"OLD HUNDRED",old_hundredth_bourgeois,117651233332143,English,,
"Best Hymns No. 4","Old Hundred","Praise God, from Whom all blessings flow",praise_god_from_whom_all_blessings_ken,BH41907,183,"Old Hundred",,"Thos. Ken","G. Franc",,"[Praise God, from Whom all blessings flow]",old_hundredth_bourgeois,117651233332143,English,,
"Better Than Pearls: sacred songs expressly adapted for gospel meetings","Praise God from whom all blessings flow!","Praise God from whom all blessings flow!",praise_god_from_whom_all_blessings_ken,BTP1881,108,,,,,,OLDEN,olden_mason,5151122334432132,English,,
"Book of Hymns and Tunes, comprising the psalms and hymns for the worship of God, approved by the general assembly of 1866, arranged with appropriate tunes... by authority of the assembly of 1873","Praise God, from whom all blessings flow!","Praise God, from whom all blessings flow!",praise_god_from_whom_all_blessings_ken,BHTC1874,4D,,,,,,,,,English,,
"Book of Hymns and Tunes, comprising the psalms and hymns for the worship of God, approved by the general assembly of 1866, arranged with appropriate tunes... by authority of the assembly of 1873","Praise God from whom all blessings flow","Praise God from whom all blessings flow",praise_god_from_whom_all_blessings_ken,BHTC1874,55a,,,,Mason,,MENDON,mendon_german,17151712131621271222,English,,"German Air"
"Book of Praise for the Sunday School: with hymns and tunes appropriate for the prayer meeting and the home circle","Hallelujah, Hallelujah","Praise God, from whom all blessings flow",praise_god_from_whom_all_blessings_ken,BPSS1875,212,,"Hallelujah, Hallelujah","Bishop Thomas Ken",,,,,,English,,
"Book of Worship (Rev. ed.)","Praise God, from whom all blessings flow","Praise God, from whom all blessings flow",praise_god_from_whom_all_blessings_ken,BW1870,D2,,,,,8.8.8.8,,,,English,,
"Book of Worship with Hymns and Tunes ","Praise God, from whom all blessings flow","Praise God, from whom all blessings flow",praise_god_from_whom_all_blessings_ken,BWHT1899,D2,,,,,8.8.8.8,,,,English,,
"Book of Worship: with tunes",Doxology,"Praise God, from whom all blessings flow",praise_god_from_whom_all_blessings_ken,BoW1881,C47b,Doxology,,,,,"[Praise God, from whom all blessings flow]",dedication_anthem_stanley,1113323423567123432,English,,
"Book of Worship: with tunes","Praise God, from whom all blessings flow","Praise God, from whom all blessings flow",praise_god_from_whom_all_blessings_ken,BoW1881,D2,,,,,,,,,English,,
"Bradbury's Sabbath School Melodies, and Family Choir: a complete collection of hymns and music for all Sabbath school occasions","Praise God, from whom all blessings flow","Praise God, from whom all blessings flow",praise_god_from_whom_all_blessings_ken,SSMF1854,36,,,,,,,,,English,,
"Breaking Bread (Vol. 39)","Praise God, from Whom All Blessings Flow","Praise God, from whom all blessings flow",praise_god_from_whom_all_blessings_ken,BB2020,540,"Praise God, from Whom All Blessings Flow",,"Thomas Ken, 1637-1711; Isaac Watts, 1674-1748","Louis Bourgeois, ca. 1510-1561",8.8.8.8,"OLD HUNDREDTH",old_hundredth_bourgeois,117651233332143,English,,"<cite>Genevan Psalter</cite>, 1551"
"Bright Gems: for Sabbath-schools, prayer-meetings, services of song, etc.","Praise God, from whom all blessings flow","Praise God, from whom all blessings flow",praise_god_from_whom_all_blessings_ken,BG1881,134,,,,"G. Franc",,"OLD HUNDRED",old_hundredth_bourgeois,117651233332143,English,,
"Bright Jewels for the Sunday School: a new collection of Sunday School songs written expressly for this work, many of which are the latest compositions of William B. Bradbury...","Praise God, from whom all blessings flow","Praise God, from whom all blessings flow",praise_god_from_whom_all_blessings_ken,BJSS1869,157.21,,,,,,,,,English,,
"Bright Melodies: for the Sunday school and young people's societies embracing praise hymns, work songs, invitation songs, primary songs, etc., etc.",Doxology,"Praise God, from whom all blessings flow",praise_god_from_whom_all_blessings_ken,BM1899,5b,Doxology,,,,,"OLD HUNDRED",old_hundredth_bourgeois,117651233332143,English,,
"Brightest Glory: a collection of choice original hymns and tunes, by our best composers, for the Sunday schools, young people's meetings, and all religious gatherings","Praise God from whom all blessings flow","Praise God from whom all blessings flow",praise_god_from_whom_all_blessings_ken,BG1894,171,,,,"G. Franc",,"OLD HUNDRED",old_hundredth_bourgeois,117651233332143,English,,
"Calvary Songs","Praise God, from whom all blessings flow","Praise God, from whom all blessings flow",praise_god_from_whom_all_blessings_ken,CS1875,163e,,,,,,,,,English,,
"Calvary's Praises",Doxology,"Praise God from whom all blessings flow",praise_god_from_whom_all_blessings_ken,CP1917,294,Doxology,,"Thos. Ken","G. Franc",,"OLD HUNDRED",old_hundredth_bourgeois,117651233332143,English,,
"Carmina Sanctorum: a selection of hymns and songs of praise with tunes","Praise God, from whom all blessings flow","Praise God, from whom all blessings flow",praise_god_from_whom_all_blessings_ken,CS1885,D3,,,"Bp. Thomas Ken (1637-1711)",,,,,,English,,