hymnalTitle,displayTitle,firstLine,textAuthNumber,hymnalID,number,textTitle,refrainFirstLine,authors,composers,meter,tuneTitle,tuneAuthNumber,incipit,languages,textSources,tuneSources
"A Book of Hymns for Public and Private Devotion (15th ed.)","Good Lord, Remember Me","O Thou, from whom all goodness flows",o_thou_from_whom_all_goodness_flows,BHPPD866,211,"Good Lord, Remember Me",,Humphries,,8.6.8.6,,,,English,,
"A Book of Hymns for Public and Private Devotion. (10th ed.)","O Thou, from whom all goodness flows","O Thou, from whom all goodness flows",o_thou_from_whom_all_goodness_flows,BHPP1857,211,,,Humphries,,,,,,English,,
"A Choice Selection of Hymns and Spiritual Songs for the use of the Baptist Church and all lovers of song","O Thou from whom all goodness flows","O Thou from whom all goodness flows",o_thou_from_whom_all_goodness_flows,CSHS1877,569,,,"Thomas Haweis",,,,,,English,,
"A Choice Selection of Hymns and Spiritual Songs: designed for the use of  the pious","O thou, from whom all goodness flows","O thou, from whom all goodness flows",o_thou_from_whom_all_goodness_flows,CSHS1813,XVII,,,,,,,,,English,,
"A Church Hymn Book: for the use of congregations of the United Church of England and Ireland","O Thou from whom all goodness flows","O Thou from whom all goodness flows",o_thou_from_whom_all_goodness_flows,CHBU1861,113,,,,,8.6.8.6,,,,English,,
"A Church hymnal: compiled from ""Additional hymns,"" ""Hymns ancient and modern,"" and ""Hymns for church and home,"" as authorized by the House of Bishops","O Thou, from Whom all goodness flows","O Thou, from Whom all goodness flows",o_thou_from_whom_all_goodness_flows,CHCF1870,445,,,,,,,,,,,
"A Church of England Hymn Book: adapted to the daily services of the Church throughout the year","O thou, from whom all goodness flows","O thou, from whom all goodness flows",o_thou_from_whom_all_goodness_flows,CEHB1880,375,,,,,8.6.8.6,,,,English,,
"A Collection of Hymns","O Thou, from whom all goodness flows","O Thou, from whom all goodness flows",o_thou_from_whom_all_goodness_flows,CH1859,330,,,,,,,,,English,,
"A Collection of Hymns and a Liturgy: for the use of Evangelical Lutheran Churches, to which are added prayers for families and individuals (New and Enl. Stereotype Ed.)","O thou, from whom all goodness flows","O thou, from whom all goodness flows",o_thou_from_whom_all_goodness_flows,CHLE1827,583,,,,,,,,,English,,
"A Collection of Hymns for the use of the African Methodist Episcopal Zion Church in America","Remember me!","O thou from whom all goodness flows",o_thou_from_whom_all_goodness_flows,ACOH1872,752,"Remember me!",,,,8.6.8.6,,,,English,,
"A Collection of Hymns, for the Christian Church and Home","O Thou, from whom all goodness flows!","O Thou, from whom all goodness flows!",o_thou_from_whom_all_goodness_flows,CHCC1843,116,,,"T. Humphries",,,,,,English,,
"A Collection of Psalms and Hymns for Christian Worship","O Thou, from whom all goodness flows","O Thou, from whom all goodness flows",o_thou_from_whom_all_goodness_flows,CPHC1830,395,,,"T. Humphries",,,,,,English,,
"A Collection of Psalms and Hymns for Christian Worship (10th ed.)","O thou, from whom all goodness flows","O thou, from whom all goodness flows",o_thou_from_whom_all_goodness_flows,CPHC1833,395,,,"T. Humphries",,8.6.8.6,,,,English,,
"A Collection of Psalms and Hymns for Christian Worship (6th ed.)","O Thou, from whom all goodness flows","O Thou, from whom all goodness flows",o_thou_from_whom_all_goodness_flows,CPHC1832,395,,,"T. Humphries",,8.6.8.6,,,,English,,
"A Collection of Psalms and Hymns for Christian Worship. (3rd ed.)","O Thou, from whom all goodness flows","O Thou, from whom all goodness flows",o_thou_from_whom_all_goodness_flows,CPHC1831,395,,,"T. Humphries",,,,,,English,,
"A Collection of Psalms and Hymns for Christian Worship. (45th ed.)","O Thou from whom all goodness flows","O Thou from whom all goodness flows",o_thou_from_whom_all_goodness_flows,CPHC1846,395,,,"Thomas Haweis",,,,,,English,,
"A Collection of Psalms and Hymns for Christian Worship. 16th ed.","O thou, from whom all goodness flows","O thou, from whom all goodness flows",o_thou_from_whom_all_goodness_flows,CPHC1835,395,,,"T. Humphries",,8.6.8.6,,,,English,,
"A Collection of Psalms and Hymns for the Sanctuary","O Thou, from whom all goodness flows","O Thou, from whom all goodness flows",o_thou_from_whom_all_goodness_flows,CPH1845,383,,,"T. Humphries",,,,,,English,,
"A Collection of Psalms and Hymns for the use of Universalist Societies and Families (13th ed.)","O Thou, from whom all goodness flows","O Thou, from whom all goodness flows",o_thou_from_whom_all_goodness_flows,CPHU1842,404,,,"T. Humphries",,,,,,English,,
"A Collection of Psalms and Hymns for the Use of Universalist Societies and Families 16ed.  ","O Thou from whom all goodness flows","O Thou from whom all goodness flows",o_thou_from_whom_all_goodness_flows,CPHU1845,404,,,"T. Humphries",,8.6.8.6,,,,English,,
"A Collection of Psalms and Hymns, for Social and Private Worship (Rev. ed.  with supplement)","O thou, from whom all goodness flows","O thou, from whom all goodness flows",o_thou_from_whom_all_goodness_flows,CPHS1845,597,,,"T. Humphries",,,,,,English,,
"A Liturgy and Hymns for Church Sunday Schools","O thou, from whom all goodness flows","O thou, from whom all goodness flows",o_thou_from_whom_all_goodness_flows,LHCS1850,160,,,,,,,,,English,,
"A New and Choice Selection of Hymns and Spiritual Songs for the Use of the Regular Baptist Church. 10th ed.","O Thou from whom all goodness flows","O Thou from whom all goodness flows",o_thou_from_whom_all_goodness_flows,NCSH1877,d384,,,"Thomas Haweis",,,,,,English,,
"A New Selection of Nearly Eight Hundred Evangelical Hymns, from More than  200 Authors in England, Scotland, Ireland, & America, including a great number of originals, alphabetically arranged","O thou, from whom all goodness flows","O thou, from whom all goodness flows",o_thou_from_whom_all_goodness_flows,NSNE1825,480,,,Haweis,,,,,,English,,
"A New Selection of Seven Hundred Evangelical Hymns ... intended as a        Supplement to Dr. Watts's Psalms and Tunes","O Thou, from whom all goodness flows","O Thou, from whom all goodness flows",o_thou_from_whom_all_goodness_flows,NSSH1810,480,,,Haweis,,8.6.8.6,,,,English,,
"A Selection of Hymns for the Use of Church of England Sunday Schools, Bible Classes ... New ed.","Remember me","O Thou from whom all goodness flows",o_thou_from_whom_all_goodness_flows,SHUC1862,d223,,"Remember me","Thomas Haweis",,,,,,English,,
"A Selection of Hymns for the Use of Social Religious Meetings and for Private Devotions. 7th ed.","O thou from whom all goodness flows","O thou from whom all goodness flows",o_thou_from_whom_all_goodness_flows,SHUS1833,221,,,,,,,,,English,,
"A Selection of Hymns for the use of social religious meetings, and for private devotions 2d ed.","O Thou from whom all goodness flows","O Thou from whom all goodness flows",o_thou_from_whom_all_goodness_flows,SoH21820,200,,,"Thomas Haweis",,,,,,English,,
"A Selection of Hymns, adapted to the devotions of the closet, the family, and the social circle; and containing subjects appropriate to the monthly concerns of prayer for the success...","O Thou from whom all goodness flows","O Thou from whom all goodness flows",o_thou_from_whom_all_goodness_flows,SHAD1831,494,,,"Thomas Haweis",,,,,,English,,
"A Selection of Hymns....3d ed","O Thou from whom all goodness flows","O Thou from whom all goodness flows",o_thou_from_whom_all_goodness_flows,SoH31822,d180,,,"Thomas Haweis",,,,,,English,,
"A Selection of Hymns: designed as a supplement to the ""psalms and hymns"" of the Presbyterian church","O Thou from whom all goodness flows","O Thou from whom all goodness flows",o_thou_from_whom_all_goodness_flows,SHDS1861,232,,,,,,,,,English,,
"A Selection of Hymns: including a few originals, designed to aid the friends of  Zion in their private and social worship","O thou,  from whom all goodness flows","O thou,  from whom all goodness flows",o_thou_from_whom_all_goodness_flows,SHIF1831,267,,,Haweis,,,,,,English,,
"A Selection of Psalms and Hymns for ... Diocese of Nova Scotia. 3rd ed.","O Thou from whom all goodness flows","O Thou from whom all goodness flows",o_thou_from_whom_all_goodness_flows,SPHD1859,d265,,,"Thomas Haweis",,,,,,English,,
"A Selection of Psalms and Hymns for the Use of the Diocese of Nova Scotia. 3rd ed.","O Thou from whom all goodness flows","O Thou from whom all goodness flows",o_thou_from_whom_all_goodness_flows,SPHU1859,d264,,,"Thomas Haweis",,,,,,English,,
"A Selection of Spiritual Songs: with music for the Church and the Choir","O thou, from whom all goodness flows","O thou, from whom all goodness flows",o_thou_from_whom_all_goodness_flows,SoSS1878,455,,,"T. Haweis",,,,,,English,,
"Additional Hymns to the Collection of Hymns for the use of Evangelical     Lutheran Churches","O thou, from whom all goodness flows","O thou, from whom all goodness flows",o_thou_from_whom_all_goodness_flows,AHCH1835,583,,,,,,,,,English,,
"Advent Hymn Book","O Thou from whom all goodness flows","O Thou from whom all goodness flows",o_thou_from_whom_all_goodness_flows,AHB1854,d78,,,"Thomas Haweis",,,,,,English,,
"All Hail","Dear Lord, remember me","O Thou from whom all goodness flows",o_thou_from_whom_all_goodness_flows,AH1900,d144,,"Dear Lord, remember me","Thomas Haweis",,,,,,English,,
"American Lutheran Hymnal","O Thou, From Whom All Goodness Flows","O Thou, from whom all goodness flows",o_thou_from_whom_all_goodness_flows,ALH1930,288,"O Thou, From Whom All Goodness Flows",,"Thomas Haweis","Richard Redhead",8.6.8.6,REDHEAD,redhead_no_66,3211566556717666,English,,
"American Psalmody: a collection of sacred music, comprising a great variety of psalm, and hymn tunes, set-pieces, anthems and chants, arranged with a figured bass for the organ...(3rd ed.)","O thou, from whom all goodness flows","O thou, from whom all goodness flows",o_thou_from_whom_all_goodness_flows,AP1834,66b,,,,,,,,,English,,
"Anglican Hymn Book","O thou, from whom all goodness flows","O thou, from whom all goodness flows",o_thou_from_whom_all_goodness_flows,AHB1868,235,,,,,8.6.8.6,,,,English,,
"Book of Common Praise","O Thou from whom all goodness flows","O Thou from whom all goodness flows",o_thou_from_whom_all_goodness_flows,BoCP1915,d425,,,"Thomas Haweis",,,,,,English,,
"Book of Hymns and Tunes, comprising the psalms and hymns for the worship of God, approved by the general assembly of 1866, arranged with appropriate tunes... by authority of the assembly of 1873","O Thou from whom all goodness flows","O Thou from whom all goodness flows",o_thou_from_whom_all_goodness_flows,BHTC1874,191c,,,,,,,,,English,,
"Book of Worship (Rev. ed.)","O Thou, from whom all goodness flows","O Thou, from whom all goodness flows",o_thou_from_whom_all_goodness_flows,BW1870,378,,,,,8.6.8.6,,,,English,,
"Book of Worship with Hymns and Tunes ","O Thou, from whom all goodness flows","O Thou, from whom all goodness flows",o_thou_from_whom_all_goodness_flows,BWHT1899,396,,,"Thomas Haweis","John B. Dykes",,BEATITUDO,beatitudo_dykes,123531436713222,English,,
"Book of Worship: with tunes","O Thou, from whom all goodness flows","O Thou, from whom all goodness flows",o_thou_from_whom_all_goodness_flows,BoW1881,378,,,,"G. Rossini",,MANOAH,manoah_greatorex,12321776623432117532,English,,
"Calvary Selection of Spiritual Songs with Music for the Church and     the Choir","O Thou from whom all goodness flows","O Thou from whom all goodness flows",o_thou_from_whom_all_goodness_flows,CSSS1878,d685,,,"Thomas Haweis",,,,,,English,,
"Chapel Hymns","O Thou from whom all goodness flows","O Thou from whom all goodness flows",o_thou_from_whom_all_goodness_flows,CH1846,d420,,,"Thomas Haweis",,,,,,English,,
"Chapel Melodies","Lord, Remember Me","O Thou from whom all goodness flows",o_thou_from_whom_all_goodness_flows,CM1868,135,"Lord, Remember Me","I know I'm weak, I know I'm vile",,"R. L.",,"[O Thou from whom all goodness flows]",o_thou_from_whom_all_goodness_flow_55111,551112345543111,English,,
"Choice Hymns: for social and private devotion, Lord's Day schools and revivals. (2nd ed.)","O Thou, from whom all goodness flows!","O Thou, from whom all goodness flows!",o_thou_from_whom_all_goodness_flows,CHSP1842,152,,,,,,,,,,,
"Christian Hymnal","O Thou from whom all goodness flows","O Thou from whom all goodness flows",o_thou_from_whom_all_goodness_flows,CH1924,d358,,,"Thomas Haweis",,,,,,English,,
"Christian Hymns: for church, school and home, with music","O Thou, from whom all goodness flows","O Thou, from whom all goodness flows",o_thou_from_whom_all_goodness_flows,CHCS1898,94,,,,"G. Kirbye",8.6.8.6,WINDSOR,windsor_tye_daman,11232117354323354321,English,,
"Christian Melodies: a selection of hymns and tunes designed for social and private worship in the lecture-room and the family","O Thou from whom all goodness flows","O Thou from whom all goodness flows",o_thou_from_whom_all_goodness_flows,CM1851,97,,,"J. Humphries",,,YORK,york_scottish,135463522355451,English,,
"Christian Melodies: a selection of hymns and tunes designed for social and private worship in the lecture-room and the family (2nd ed.)","O Thou from whom all goodness flows","O Thou from whom all goodness flows",o_thou_from_whom_all_goodness_flows,CM1854,97,,,"J. Humphries",,,YORK,york_scottish,135463522355451,English,,
"Christian Praise: a manual of worship for public, social and private devotion","O Thou, from whom all goodness flows","O Thou, from whom all goodness flows",o_thou_from_whom_all_goodness_flows,CP1880,281,,,"Thomas Haweis",,,,,,English,,
"Christian Psalms and Hymns to Aid in Public and Private Devotion","O Thou from whom all goodness flows","O Thou from whom all goodness flows",o_thou_from_whom_all_goodness_flows,CPHA1856,d694,,,"Thomas Haweis",,,,,,English,,
"Church Book: for the use of Evangelical Lutheran congregations","O thou, from whom all goodness flows","O thou, from whom all goodness flows",o_thou_from_whom_all_goodness_flows,CBUE1868,490,,,"Thomas Haweis",,,,,,English,,
"Church Book: for the use of Evangelical Lutheran congregations","O Thou, from whom all goodness flows","O Thou, from whom all goodness flows",o_thou_from_whom_all_goodness_flows,CBWM1872,490,,,"Thomas Haweis",,8.6.8.6,"CHRISTUS CONSOLATOR",christus_consolator_monk,327155433457655434,English,,
"Church Chorals and Choir Studies","O Thou from whom all goodness flows","O Thou from whom all goodness flows",o_thou_from_whom_all_goodness_flows,CCCS1850,64,,,Humphries,Ravenscroft,,CANTERBURY,canterbury_playford,132312344321322,English,,
"Church Harmonies: a collection of hymns and tunes for the use of Congregations","O thou, from whom all goodness flows","O thou, from whom all goodness flows",o_thou_from_whom_all_goodness_flows,CHCH1876,588,,,Haweis,,,,,,English,,
"Church Hymnal","O Thou from whom all goodness flows","O Thou from whom all goodness flows",o_thou_from_whom_all_goodness_flows,CH1886,58,,,,,,BURFORD,burford_purcell,1123454327123455,English,,"Old Melody"
"Church Hymnal, Third Edition","O thou, from whom all goodness flows","O thou, from whom all goodness flows",o_thou_from_whom_all_goodness_flows,ICH3,581,,,,,,,,,English,,
"Church Hymns and Services, Published under License of the Church Pension Fund","O Thou from whom all goodness flows","O Thou from whom all goodness flows",o_thou_from_whom_all_goodness_flows,CHSP1934,d181,,,"Thomas Haweis",,,,,,English,,
"Church Hymns and Tunes","O Thou, from Whom all goodness flows","O Thou, from Whom all goodness flows",o_thou_from_whom_all_goodness_flows,CHT1907,429,,,"Rev. Thomas Haweis","A. Cottman",,DALEHURST,dalehurst_cottman,321433211234442,English,,
"Church Hymns with Tunes","O thou, from whom all goodness flows","O thou, from whom all goodness flows",o_thou_from_whom_all_goodness_flows,ChH1874,459,,,,,8.6.8.6,,,,English,,
"Church Hymns: with tunes (New ed.)","O Thou, from Whom all goodness flows","O Thou, from Whom all goodness flows",o_thou_from_whom_all_goodness_flows,CH1903,509,,,,"T. Tallis, 1520?-1858",,"TALLIS'S ORDINAL",tallis_ordinal,134556655176651345,English,,
"Church music: with selections for the ordinary occasions of public and social worship, from the Psalms and hymns of the Presbyterian Church in the United States of America","O thou from whom all goodness flows","O thou from whom all goodness flows",o_thou_from_whom_all_goodness_flows,CMWS1855,340,,,,,,,,,English,,
"Cole's Pocket Edition of Psalm and Hymn Tunes, Containing Most of the Tunes Used in Different Churches","O Thou from whom all goodness flows","O Thou from whom all goodness flows",o_thou_from_whom_all_goodness_flows,CPEP1834,d106,,,"Thomas Haweis",,,,,,English,,
"Collection of Hymns for Public and Private Worship. 4th ed.","O Thou from whom all goodness flows","O Thou from whom all goodness flows",o_thou_from_whom_all_goodness_flows,CHPP1863,d208,,,"Thomas Haweis",,,,,,English,,
"Common Praise: hymns with tunes for Christian worship","O Thou, from whom all goodness flows","O Thou, from whom all goodness flows",o_thou_from_whom_all_goodness_flows,CP1913,368,,,"Thomas Cotterill; T. Haweis",,,"WINCHESTER OLD",winchester_old_kirbye,133214432355453,English,,"Este's Psalter"
"Common Service Book of the Lutheran Church","O Thou, from Whom all goodness flows","O Thou, from Whom all goodness flows",o_thou_from_whom_all_goodness_flows,LHTC1918,394,,,"Thomas Haweis","Richard Redhead",,"REDHEAD, No. 66",redhead_no_66,3211566556717666,English,,
"Compilation of Hymns for the Use of the Churches of the Christian Union","O Thou from whom all goodness flows","O Thou from whom all goodness flows",o_thou_from_whom_all_goodness_flows,CHUC1871,d535,,,"Thomas Haweis",,,,,,English,,
"Congregational Hymn and Tune Book; containing the Psalms and Hymns of the General Association of Connecticut, adapted to Suitable Tunes","O Thou from whom all goodness flows","O Thou from whom all goodness flows",o_thou_from_whom_all_goodness_flows,CHTB1856,534,,,"Thomas Haweis",,,,,,English,,
"Coronation Hymns and Songs: for praise and prayer meetings, home and social singing","O Thou from whom all goodness flows","O Thou from whom all goodness flows",o_thou_from_whom_all_goodness_flows,CHS1879,109,,,Haweis,,,,,,English,,
"Cottage Melodies; a hymn and tune book, for prayer and social meetings and the home circle","O Lord, remember me","O thou from whom all goodness flows",o_thou_from_whom_all_goodness_flows,CM1859,514,,"O Lord, remember me",,,,,,,English,,
"Crowning Day No. 4","All Goodness Flows","O Thou, from Whom all goodness flows",o_thou_from_whom_all_goodness_flows,CD41900,254,"All Goodness Flows",,"Rev. Thomas Haweis","Hugh Wilson",,"[O Thou, from Whom all goodness flows]",martyrdom_wilson,51651232135321325321,English,,
"Cân a Mawl: llyfr hymna a thonau Methodistiaid Calfinaidd Unol Dalaethau yr America=Song and Praise: the hymnal of the Calvinistic Methodist Church of the United States of America","O Thou, from Whom all goodness flows","O Thou, from Whom all goodness flows",o_thou_from_whom_all_goodness_flows,CMSP1918,143b,,,"T. Haweis","Daniel Protheroe",,MILWAUKEE,milwaukee_protheroe,55321117655671432,English,,
"Devotional Melodies: or, a collection of original and selected tunes and hymns, designed for congregational and social worship. (2nd ed.)","O thou from whom all goodness flows","O thou from whom all goodness flows",o_thou_from_whom_all_goodness_flows,DM21859,33,,,,,,,,,English,,
"Devotional Melodies; or, a collection of original and selected tunes and hymns, designed for congregational and social worship. (3rd ed.)","O Lord, remember me","O thou from whom all goodness flows",o_thou_from_whom_all_goodness_flows,DM31859,33,,"O Lord, remember me",,,,,,,English,,
"Dyer's Psalmist: A Collection of Hymns and Sacred Songs for the use of Baptist Churches (Rev. & Corrd. ed.) ","O Thou, from whom all goodness flows","O Thou, from whom all goodness flows",o_thou_from_whom_all_goodness_flows,DP1853,271,,,Haweis,,,,,,English,,
"Evangelical Hymnal","O Thou from Whom all goodness flows","O Thou from Whom all goodness flows",o_thou_from_whom_all_goodness_flows,EH1897,41,,,"Rev. Thomas Haweis","William Tansur",,"ST. MARTIN'S",st_martins_tansur_11215,112151233454312,English,,
"Evangelical Hymns: for private, family, social, and public worship; selected from various authors (3rd ed. enl.)","O Thou from whom all goodness flows","O Thou from whom all goodness flows",o_thou_from_whom_all_goodness_flows,EH31829,486,,,"Thomas Haweis",,,,,,English,,
"Evangelical Lutheran Hymn-book","O Thou, from whom all goodness flows","O Thou, from whom all goodness flows",o_thou_from_whom_all_goodness_flows,ELHL1892,358,,,,,8.6.8.6,,,,English,,
"Evangelical Lutheran Hymn-book","O Thou, from whom all goodness flows","O Thou, from whom all goodness flows",o_thou_from_whom_all_goodness_flows,ELHL1918,497,,,,,8.6.8.6,,,,English,,
"Evangelical Lutheran Hymnal","O Thou, from whom all goodness flows","O Thou, from whom all goodness flows",o_thou_from_whom_all_goodness_flows,ELH1880,426,,,,,8.6.8.6,,,,English,,
"Evangelical Lutheran Hymnal. 9th ed.","O Thou, from whom all goodness flows","O Thou, from whom all goodness flows",o_thou_from_whom_all_goodness_flows,ELH91895,a426,,,,,8.6.8.6,,,,English,,
"Evangelical Lutheran hymnal: with music","O Thou, from whom all goodness flows","O Thou, from whom all goodness flows",o_thou_from_whom_all_goodness_flows,ELHW1908,426,,,"Thomas Haweis","James P. Jewson",,MERTON,merton_jewson,12354323333432215433,English,,
"Evangelical Lutheran Hymnbook (Lutheran Conference of Missouri and Other States)","O Thou from whom all goodness flows","O Thou from whom all goodness flows",o_thou_from_whom_all_goodness_flows,ELHL1889,d269,,,"Thomas Haweis",,,,,,English,,
"Evangelical Musick: or, The Sacred Minstrel and Sacred Harp United: consisting of a great variety of psalm and hymn tunes, set pieces, anthems, etc. (10th ed)","O thou, from whom all goodness flows","O thou, from whom all goodness flows",o_thou_from_whom_all_goodness_flows,EMTS1839,60b,,,,,,,,,English,,
"Evangelical Musick: or, The Sacred Minstrel and Sacred Harp United: consisting of a great variety of psalm and hymn tunes, set pieces, anthems, etc. (10th ed)","O Thou, from whom all goodness flows","O Thou, from whom all goodness flows",o_thou_from_whom_all_goodness_flows,EMTS1839,96a,,,,,,,,,English,,
"Everybody's Hymn Book for Church and Home","Dear Lord, remember me","O Thou from whom all goodness flows",o_thou_from_whom_all_goodness_flows,EHBC1939,d230,,"Dear Lord, remember me","Thomas Haweis",,,,,,English,,
"Family and Social Melodies","O Thou from whom all goodness flows","O Thou from whom all goodness flows",o_thou_from_whom_all_goodness_flows,FSM1853,d257,,,"Thomas Haweis",,,,,,English,,
"Free Methodist Hymnal","O thou from whom all goodness flows","O thou from whom all goodness flows",o_thou_from_whom_all_goodness_flows,FMH1915,480,,,"Thomas Haweis",,,,,,English,,
"Freedom's Lyre: or psalms, hymns, and sacred songs for the slave and his firends","""Remember me""","O thou, from whom all goodness flows!",o_thou_from_whom_all_goodness_flows,FL1840,45,"""Remember me""",,Haweis,,8.6.8.6,,,,English,,
"Fulton Street Hymn Book, for the use of union prayer meetings, Sabbath schools and families","O Thou, from whom all goodness flows","O Thou, from whom all goodness flows",o_thou_from_whom_all_goodness_flows,FSHB1862,141,,,,,,,,,English,,
"Gloria Deo: a Collection of Hymns and Tunes for Public Worship in all Departments of the Church","O Thou from Whom All Goodness Flows","O Thou from whom all goodness flows",o_thou_from_whom_all_goodness_flows,GD1901,315,"O Thou from Whom All Goodness Flows",,"T. Haweis",Rossini,,MANOAH,manoah_greatorex,12321776623432117532,English,,
"Gloria in Excelsis","O Thou from whom all goodness flows","O Thou from whom all goodness flows",o_thou_from_whom_all_goodness_flows,GE1905,d510,,,"Thomas Haweis",,,,,,English,,