hymnalTitle,displayTitle,firstLine,textAuthNumber,hymnalID,number,textTitle,refrainFirstLine,authors,composers,meter,tuneTitle,tuneAuthNumber,incipit,languages,textSources,tuneSources
"Ambassador Hymnal: for Lutheran worship","Let All Things Now Living","Let all things now living",let_all_things_now_living_a_song_of_than,AH1994,150,"Let All Things Now Living",,"Katherine K. Davis, 1892-1980",,"12.11.12.11 D","ASH GROVE",ash_grove,51354311243217551321,English,,"Welsh folk tune"
"Baptist Hymnal 1991","Let All Things Now Living","Let all things now living A song of thanksgiving ",let_all_things_now_living_a_song_of_than,BH1991,640,"Let All Things Now Living",,"Katherine K. Davis",,"12.11.12.11 D","ASH GROVE",ash_grove,51354311243217551321,English,,
"Baptist Hymnal 2008","Let All Things Now Living","Let all things now living a song of thanksgiving ",let_all_things_now_living_a_song_of_than,BH2008,640,"Let All Things Now Living",,"Katherine K. Davis",,"12.11.12.11 D","ASH GROVE",ash_grove,51354311243217551321,English,,"Traditional Welsh Melody"
"Breaking Bread (Vol. 39)","Let All Things Now Living","Let all things now living",let_all_things_now_living_a_song_of_than,BB2020,598,"Let All Things Now Living",,"Katherine K. Davis, 1892-1980",,"6.6.1.1.6.6.1.1 D","ASH GROVE",ash_grove,51354311243217551321,English,,"Trad. Welsh melody"
"Catholic Book of Worship III","Let All Things Now Living","Let all things now living",let_all_things_now_living_a_song_of_than,CBOW1994,534,"Let All Things Now Living",,"Katherine K. Davis, 1892-1980",,,"ASH GROVE",ash_grove,51354311243217551321,English,,"Welsh traditional"
"Celebrating Grace Hymnal","Let All Things Now Living","Let all things now living a song of thanksgiving",let_all_things_now_living_a_song_of_than,CGH2010,379,"Let All Things Now Living",,"Katherine K. Davis",,"12.11.12.11 D","ASH GROVE",ash_grove,51354311243217551321,English,,"Traditional Welsh Melody"
"Chalice Hymnal","Let All Things Now Living","Let all things now living",let_all_things_now_living_a_song_of_than,CH1995,717,"Let All Things Now Living",,"Katherine K. Davis","Katherine K. Davis","6.6.11.6.6.11 D","ASH GROVE",ash_grove,51354311243217551321,English,,
"Christian Science Hymnal: Hymns 430-603","Let All Things Now Living","Let all things now living",let_all_things_now_living_a_song_of_than,CSH2017,520,"Let All Things Now Living",,"Katherine K. Davis",CSPS,,"ASH GROVE",ash_grove,51354311243217551321,English,,"Welsh melody, Jones's <cite>The Bardic Museum</cite>, 1802"
"Christian Worship (1993): a Lutheran hymnal","Let All Things Now Living","Let all things now living",let_all_things_now_living_a_song_of_than,CWLH1993,260,"Let All Things Now Living",,"Katherine K. Davis, 1892-1980",,"6.6.1.1.6.6.1.1 D","THE ASH GROVE",ash_grove,51354311243217551321,English,,"Welsh folk tune"
"Christian Worship: Hymnal","Let All Things Now Living","Let all things now living",let_all_things_now_living_a_song_of_than,CWH2021,507,"Let All Things Now Living",,"Katherine K. Davis, 1892-1980",,"6.6.1.1.6.6.1.1 D","THE ASH GROVE",ash_grove,51354311243217551321,English,,"Welsh; Setting: <cite>Lutheran Book of Worship</cite>, 1978"
"Common Praise (1998)","Let All Things Now Living","Let all things now living a song of thanksgiving",let_all_things_now_living_a_song_of_than,CP1998,403,"Let All Things Now Living",,"Katherine K. Davis (1892-1980)",,"12.11.12.11 D","THE ASH GROVE",ash_grove,51354311243217551321,English,,"Welsh trad. "
"Evangelical Lutheran Worship","Let All Things Now Living","Let all things now living",let_all_things_now_living_a_song_of_than,ELW2006,881,"Let All Things Now Living",,"Katherine K. Davis, 1892-1980",,"6.6.11.6.6.11 D","THE ASH GROVE",ash_grove,51354311243217551321,English,,"Welsh  folk tune"
"Gather (3rd ed.)","Let All Things Now Living","Let all things now living",let_all_things_now_living_a_song_of_than,G32011,635,"Let All Things Now Living",,"Katherine K. Davis, 1892-1980","Gerald H. Knight, 1908-1979","6.6.1.1.6.6.1.1 D","ASH GROVE",ash_grove,51354311243217551321,English,,Welsh
"Gather Comprehensive","Let All Things Now Living","Let all things now living",let_all_things_now_living_a_song_of_than,GC1994,567,"Let All Things Now Living",,"Katherine K. Davis, 1892-1980","Gerald H. Knight, 1908-1979","6.6.11.6.6.11 D","ASH GROVE",ash_grove,51354311243217551321,English,,Welsh
"Gather Comprehensive, Second Edition","Let All Things Now Living","Let all things now living",let_all_things_now_living_a_song_of_than,GC2,551,"Let All Things Now Living",,"Katherine K. Davis, 1892-1980","Gerald H. Knight, 1908-1979","6.6.1.1.6.6.1.1 D","ASH GROVE",ash_grove,51354311243217551321,English,,Welsh
"Glory and Praise (3rd. ed.)","Let All Things Now Living","Let all things now living",let_all_things_now_living_a_song_of_than,GAP2015,706,"Let All Things Now Living",,"Katherine K. Davis, 1892-1980","Randall DeBruyn, b. 1947","6.6.1.1.6.6.1.1 D","ASH GROVE",ash_grove,51354311243217551321,English,,"Trad. Welsh melody"
"Glory to God: the Presbyterian Hymnal","Let All Things Now Living","Let all things now living",let_all_things_now_living_a_song_of_than,GG2013,37,"Let All Things Now Living",,"Katherine K. Davis","Gerald H. Knight","6.6.11.6.6.11 D","ASH GROVE",ash_grove,51354311243217551321,English,,"Welsh folk melody"
"Hymns for a Pilgrim People: a congregational hymnal","Let All Things Now Living","Let all things now living",let_all_things_now_living_a_song_of_than,HPP2007,34,"Let All Things Now Living",,"Katherine K. Davis, 1892-1980",,"6.6.11.6.6.11 D","ASH GROVE",ash_grove,51354311243217551321,English,,"Traditional Welsh Melody"
"Hymns for the Family of God","Let All Things Now Living","Let all things now living",let_all_things_now_living_a_song_of_than,HFFG1976,389,"Let All Things Now Living",,"Katherine K. Davis; John Cowley","Katherine K. Davis",,"ASH GROVE",ash_grove,51354311243217551321,English,,
"Hymns of Promise: a large print songbook","Let All Things Now Living","Let all things now living a song of thanksgiving",let_all_things_now_living_a_song_of_than,HOP2015,22,"Let All Things Now Living",,"Katherine K. Davis, 1892-1980",,"12.11.12.11 D","ASH GROVE",ash_grove,51354311243217551321,English,,"Welsh melody"
"Hymns of the Church","Let all things now living","Let all things now living",let_all_things_now_living_a_song_of_than,HotC2011,14,,,,,,"THE ASH GROVE",ash_grove,51354311243217551321,English,,
"Journeysongs (2nd ed.)","Let All Things Now Living","Let all things now living",let_all_things_now_living_a_song_of_than,JS2003,641,"Let All Things Now Living",,"Katherine K. Davis, 1892-1980",,"6.6.1.1.6.6.1.1 D","ASH GROVE",ash_grove,51354311243217551321,English,,"Trad. Welsh melody"
"Journeysongs (3rd ed.)","Let All Things Now Living","Let all things now living",let_all_things_now_living_a_song_of_than,JS2012,608,"Let All Things Now Living",,"Katherine K. Davis, 1892-1980","Randall DeBruyn, b. 1947","6.6.1.1.6.6.1.1 D","ASH GROVE",ash_grove,51354311243217551321,English,,"Welsh melody"
"Lead Me, Guide Me (2nd ed.)","Let All Things Now Living","Let all things now living",let_all_things_now_living_a_song_of_than,LMGM2012,486,"Let All Things Now Living",,"Katherine K. Davis, 1892-1980","Gerald H. Knight, 1908-1979","6.6.1.1.6.6.1.1 D","ASH GROVE",ash_grove,51354311243217551321,English,,"Welsh melody"
"Lift Up Your Hearts: psalms, hymns, and spiritual songs","Let All Things Now Living","Let all things now living",let_all_things_now_living_a_song_of_than,LUYH2013,5,"Let All Things Now Living",,"Katherine K. Davis","Katherine K. Davis","6.6.11.6.6.11 D","ASH GROVE",ash_grove,51354311243217551321,English,,
"Lutheran Book of Worship","Let All Things Now Living","Let all things now living",let_all_things_now_living_a_song_of_than,LBoW1978,557,"Let All Things Now Living",,"Katherine K. Davis, b. 1892",,"6.6.11.6.6.11 D","THE ASH GROVE",ash_grove,51354311243217551321,English,,"Welsh folk tune"
"Moravian Book of Worship","Let All Things Now Living","Let all things now living",let_all_things_now_living_a_song_of_than,Mor1995,448,"Let All Things Now Living",,"Katherine K. Davis","Katherine K. Davis","6.6.11.6.6.11 D","ASH GROVE",ash_grove,51354311243217551321,English,,"Welsh folk tune"
"One in Faith","Let All Things Now Living","Let all things now living",let_all_things_now_living_a_song_of_than,OIF2014,895,"Let All Things Now Living",,"Katherine K. Davis, 1892-1980","Charles G. Frischmann","6.6.1.1.6.6.1.1 D","THE ASH GROVE",ash_grove,51354311243217551321,English,,"Traditional Welsh folk melody"
"Oramos Cantando = We Pray In Song","Let All Things Now Living (Que Todo Viveinte)","Let all things now living (Que todo viveinte)",let_all_things_now_living_a_song_of_than,OC2013,538,"Let All Things Now Living (Que Todo Viveinte)",,"Katherine K. Davis, 1892-1980; Dimas Planas-Belfort, 1934-1992","Gerald H. Knight, 1908-1979","6.6.1.1.6.6.1.1 D","ASH GROVE",ash_grove,51354311243217551321,"English; Spanish",,Welsh
"Psalms, Hymns, and Spiritual Songs","Let all things now living","Let all things now living",let_all_things_now_living_a_song_of_than,PHSS2012,27,,,,,,"ASH GROVE",ash_grove,51354311243217551321,,,
"Psalter Hymnal (Gray)","Let All Things Now Living","Let all things now living",let_all_things_now_living_a_song_of_than,PsH,453,"Let All Things Now Living",,"Katherine K. Davis","Katherine K. Davis","6.6.1.1.6.6.1.1 D","ASH GROVE",ash_grove,51354311243217551321,English,,Welsh
"Rejoice Hymns","Let All Things Now Living","Let all things now living",let_all_things_now_living_a_song_of_than,RH2011,63,"Let All Things Now Living",,"Katherine K. Davis, 1892-1980",,"6.6.11.6.6.11 D","ASH GROVE",ash_grove,51354311243217551321,English,,"Traditional Welsh Melody"
"Renew! Songs and Hymns for Blended Worship","Let All Things Now Living","Let all things now living",let_all_things_now_living_a_song_of_than,RN1995,48,"Let All Things Now Living",,"Katherine K. Davis","Katherine K. Davis","12.11.12.11 D","ASH GROVE",ash_grove,51354311243217551321,English,,
"RitualSong (2nd ed.)","Let All Things Now Living","Let all things now living",let_all_things_now_living_a_song_of_than,RS2016,747,"Let All Things Now Living",,"Katherine K. Davis, 1892-1980","Gerald H. Knight, 1908-1979","6.6.1.1.6.6.1.1 D","ASH GROVE",ash_grove,51354311243217551321,English,,Welsh
"RitualSong: a hymnal and service book for Roman Catholics","Let All Things Now Living","Let all things now living",let_all_things_now_living_a_song_of_than,RS1996,707,"Let All Things Now Living",,"Katherine K. Davis, 1892-1980","Gerald H. Knight, 1908-1979","6.6.1.1.6.6.1.1 D","ASH GROVE",ash_grove,51354311243217551321,English,,Welsh
"Sampler: new hymns and liturgy","Let All Things Now Living","Let all things now living",let_all_things_now_living_a_song_of_than,SNHL1986,721,"Let All Things Now Living",,"Katherine K. Davis, 1892-1980",,"6.6.11.6.6.11 D","THE ASH GROVE",ash_grove,51354311243217551321,English,,"Welsh folk tune"
"Santo, Santo, Santo: cantos para el pueblo de Dios = Holy, Holy, Holy: songs for the people of God","Let All Things Now Living (Que todo viviente)","Let all things now living (Que todo viviente)",let_all_things_now_living_a_song_of_than,SSS2019,23,"Let All Things Now Living (Que todo viviente)",,"Katherine K. Davis, 1892-1980; Dimas Planas-Belfort, 1834-1992",,"6.6.1.1.6.6.1.1 D","ASH GROVE",ash_grove,51354311243217551321,"English; Spanish",,Welsh
"Seventh-day Adventist Hymnal","Let All Things Now Living","Let all things now living a song of thanksgiving",let_all_things_now_living_a_song_of_than,SDAH1985,560,"Let All Things Now Living",,"Katherine E. Davis (1895-1980)","Wayne Hooper (1920-2007)","12.11.12.11 D","THE ASH GROVE",ash_grove,"51354 31124 32175",,,"Traditional Welsh Melody"
"The Book of Praise","Let all things now living","Let all things now living a song of thanksgiving",let_all_things_now_living_a_song_of_than,TBP1997,338,"Let all things now living",,"Katherine K. Davis, 1892-1980","Gerald H. Knight, 1908-1979",,"ASH GROVE",ash_grove,51354311243217551321,English,,"Welsh traditional"
"The Celebration Hymnal: songs and hymns for worship","Let All Things Now Living","Let all things now living ",let_all_things_now_living_a_song_of_than,CEL1997,794,"Let All Things Now Living",,"Kathrine K. Davis","Tom Fettke","6.6.11.6.6.11 D","ASH GROVE",ash_grove,51354311243217551321,English,,"Traditional Welsh Melody"
"The Covenant Hymnal: a worshipbook","Let All Things Now Living","Let all things now living a song of thanksgiving",let_all_things_now_living_a_song_of_than,CHWB1996,59,"Let All Things Now Living",,"Katherine K. Davis, 1892-1980","Katherine K. Davis, 1892-1980","12.11.12.11 D","ASH GROVE",ash_grove,51354311243217551321,,,
"The Faith We Sing","Let All Things Now Living","Let all things now living",let_all_things_now_living_a_song_of_than,FWS,2008,"Let All Things Now Living",,"Katherine K. Davis","Katherine K. Davis","6.6.11.6.6.11 D","THE ASH GROVE",ash_grove,51354311243217551321,English,,
"The Presbyterian Hymnal: hymns, psalms, and spiritual songs","Let All Things Now Living","Let all things now living",let_all_things_now_living_a_song_of_than,PH1990,554,"Let All Things Now Living",,"Katherine K. Davis","Gerald H. Knight","6.6.11.6.6.11 D","ASH GROVE",ash_grove,51354311243217551321,English,,
"The Worshiping Church","Let All Things Now Living","Let all things now living a song of thanksgiving",let_all_things_now_living_a_song_of_than,TWC,53,"Let All Things Now Living",,"Katherine K. Davis","Katharine K. Davis","12.11.12.11 D","ASH GROVE",ash_grove,51354311243217551321,English,,
"Trinity Hymnal (Rev. ed.)","Let All Things Now Living","Let all things now living a song of thanksgiving",let_all_things_now_living_a_song_of_than,TH1990,125,"Let All Things Now Living",,"Katherine K. Davis","Katherine K. Davis","12.11.12.11 D","ASH GROVE",ash_grove,51354311243217551321,English,,
"Trinity Psalter Hymnal","Let All Things Now Living","Let all things now living a song of thanksgiving",let_all_things_now_living_a_song_of_than,TPH2018,254,"Let All Things Now Living",,"Katherine K. Davis","Katherine K. Davis","12.11.12.11 D","ASH GROVE",ash_grove,51354311243217551321,English,,"Traditional Welsh melody"
"Voices United: The Hymn and Worship Book of The United Church of Canada","Let All Things Now Living","Let all things now living",let_all_things_now_living_a_song_of_than,VU1996,242,"Let All Things Now Living",,"Katherine K. Davis","Katherine K. Davis","6.6.11.6.6.11 D","THE ASH GROVE",ash_grove,51354311243217551321,English,,
"We Celebrate with Song","Let all things now living, a song of thanksgiving","Let all things now living, a song of thanksgiving",let_all_things_now_living_a_song_of_than,WCS1976,d104,,,"Katherine K. Davis",,,,,,,,
"With Heart and Voice: songs for all God's children","Let All Things Now Living","Let all things now living",let_all_things_now_living_a_song_of_than,WHAV1989,121,"Let All Things Now Living",,"Katherine K. Davis","Katherine K. Davis","6.6.1.1.6.6.1.1 D","ASH GROVE",ash_grove,51354311243217551321,English,,Welsh
"Worship (3rd ed.)","Let All Things Now Living","Let all things now living",let_all_things_now_living_a_song_of_than,WHSB1986,559,"Let All Things Now Living",,"Katherine K. Davis, 1892-1980","Gerald H. Knight, 1908-1979","6.6.1.1.6.6.1.1 D","ASH GRVOE",ash_grove,51354311243217551321,English,,"Welsh "
"Worship (4th ed.)","Let All Things Now Living","Let all things now living",let_all_things_now_living_a_song_of_than,WORS2011,636,"Let All Things Now Living",,"Katherine K. Davis, 1892-1980","Gerald H. Knight, 1908-1979","6.6.1.1.6.6.1.1 D","ASH GRVOE",ash_grove,51354311243217551321,English,,"Welsh melody"
"Worship and Rejoice","Let All Things Now Living","Let all things now living a song of thanksgiving",let_all_things_now_living_a_song_of_than,WAR2003,22,"Let All Things Now Living",,"Katherine K. Davis, 1892-1980",,"12.11.12.11 D","ASH GROVE",ash_grove,51354311243217551321,English,,
"Worship His Majesty","Let All Things Now Living","Let all things now living a song of thanksgiving",let_all_things_now_living_a_song_of_than,WHM1987,78,"Let All Things Now Living",,"Katherine K. Davis; John Cowley","Katherine K. Davis",,"ASH GROVE",ash_grove,51354311243217551321,,,"Traditional Welsh Melody"
"Worship in Song: A Friends Hymnal","Let All Things Now Living","Let all things now living a song of thanksgiving",let_all_things_now_living_a_song_of_than,WinS1996,46,"Let All Things Now Living",,"Katharine K. Davis",,"12.11.12.11 D","LLWYN ON",ash_grove,51354311243217551321,,,"Traditional Welsh melody"
"Worship Supplement 2000","Let All Things Now Living","Let all things now living",let_all_things_now_living_a_song_of_than,WS2000,792,"Let All Things Now Living",,"Katherine K. Davi, 1892-1980",,"6.6.1.1.6.6.1.1 D","THE ASH GROVE",ash_grove,51354311243217551321,English,,
