hymnalTitle,displayTitle,firstLine,textAuthNumber,hymnalID,number,textTitle,refrainFirstLine,authors,composers,meter,tuneTitle,tuneAuthNumber,incipit,languages,textSources,tuneSources
"Christ in Song","They are all taken away","He will mention them no more forever",he_will_mention_them_no_more_forever,CS1900,d188,,"They are all taken away","F. E. Belden",,,,,,,,
"Christ in Song: for all religious services nearly one thousand best gospel hymns, new and old with responsive scripture readings (Rev. and Enl.)","My Sins Are All Taken Away","He will mention them no more forever",he_will_mention_them_no_more_forever,CSR1908,201,"My Sins Are All Taken Away","They are all taken away","F. E. B","F. E. Belden",,"[He will mention them no more forever]",he_will_mention_them_no_more_belden,54333323655135432354,English,,
"Christian Hymns No. 1","My sins are all taken away","He will mention them no more forever",he_will_mention_them_no_more_forever,CH11899,20,"My sins are all taken away","They are all taken away","F. C. B.","F. C. Bilden",,"[He will mention them no more forever]",he_will_mention_them_no_more_belden,54333323655135432354,English,,
"Gospel Praises: for use in meetings of Christian worship","My Sins Are All Taken Away","He will mention them no more forever",he_will_mention_them_no_more_forever,GPUM1899,35,"My Sins Are All Taken Away","They are all taken away","F. E. B.","F. E. Belden",,"[He will mention them no more forever]",he_will_mention_them_no_more_belden,54333323655135432354,English,,
"Heart Praise","My sins are all taken away","He'll remember them no more forever",he_will_mention_them_no_more_forever,HP1910,d54,"My sins are all taken away","They are all taken away","F. E. Belden",,,,,,English,,
"Hymns of Grace and Glory","My sins are all taken away","He will mention them no more forever",he_will_mention_them_no_more_forever,HoGG1901,d53,"My sins are all taken away","They are all taken away","F. E. Belden",,,,,,English,,
"Pentecostal Hymns No. 3: A winnowed collection for evangelical services, young people's societies and Sunday Schools","My sins are all taken away","He will mention them no more forever",he_will_mention_them_no_more_forever,PH31902,64,"My sins are all taken away","They are all taken away","F. E. B.","F. E. Belden",,"[He will mention them no more forever]",he_will_mention_them_no_more_belden,54333323655135432354,,,
"Pentecostal Hymns Nos. 3 and 4 Combined","My sins are all taken away","He will mention them no more forever",he_will_mention_them_no_more_forever,PH3W1902,64,"My sins are all taken away","They are all taken away","F. E. B.","F. E. Belden",,"[He will mention them no more forever]",he_will_mention_them_no_more_belden,54333323655135432354,,,
"Songs of Calvary and Pentecost","They are all taken away","He will mention them no more forever",he_will_mention_them_no_more_forever,SoCP1896,d42,,"They are all taken away","F. E. Belden",,,,,,,,
"Songs of Redemption","My Sins Are All Taken Away","He will mention them no more forever",he_will_mention_them_no_more_forever,SoR1899,114,"My Sins Are All Taken Away","They are all taken away","F. E. B.","F. E. Belden",,"[He will mention them no more forever]",he_will_mention_them_no_more_belden,54333323655135432354,English,,
"Songs of the Living Way","My sins are all taken away","He will mention them no more forever",he_will_mention_them_no_more_forever,SoLW1901,d21,"My sins are all taken away","They are all taken away","F. E. Belden",,,,,,,,
"Sunday-School Praises: prepared especially for use in the Sunday-School","My Sins Are All Taken Away","He will mention them no more forever",he_will_mention_them_no_more_forever,SSP1900,23,"My Sins Are All Taken Away","They are all taken away","F. E. B.","F. E. Belden",,"[He will mention them no more forever]",he_will_mention_them_no_more_belden,54333323655135432354,English,,
"The Best Standard Songs: for Sunday schools, social worship and young people's meetings","He Will Mention Them No More","He will mention them no more forever",he_will_mention_them_no_more_forever,BSS1896,89,"He Will Mention Them No More","They are all taken away","F. E. Belden","F. E. Belden",,"[He will mention them no more forever]",he_will_mention_them_no_more_belden,54333323655135432354,English,,
