firstLine,displayTitle,textAuthNumber,hymnalTitle,hymnalID,number,textTitle,refrainFirstLine,authors,composers,meter,tuneTitle,tuneAuthNumber,incipit,languages,textSources,tuneSources
"Abermal ein Tag [Nacht] [Jahr] verflossen","Abermal ein Tag [Nacht] [Jahr] verflossen",abermal_ein_jahr_verflossen,"Das kleine Davidische Psalterspiel der Kinder Zions",DDPK1781,aa1,,,"Joachim Neander",,,,,,German,,
"Ach, alles, was Himmel und Erde umschliesset","Ach, alles, was Himmel und Erde umschliesset",ach_alles_was_himmel_und_erde_umschliess,"Das kleine Davidische Psalterspiel der Kinder Zions",DDPK1781,aa2,,,"Johann Caspar Schade",,,,,,German,,
"Ach, dass ein jeder n'hm' in Acht","Ach, dass ein jeder n'hm' in Acht",ach_dass_ein_jeder_nhm_in_acht,"Das kleine Davidische Psalterspiel der Kinder Zions",DDPK1781,aa3,,,"Laurentius Laurenti",,,,,,German,,
"Ach Gott, in was fuer Freudigkeit schwingt","Ach Gott, in was fuer Freudigkeit schwingt",ach_gott_in_was_fuer_freudigkeit_schwing,"Das kleine Davidische Psalterspiel der Kinder Zions",DDPK1781,aa4,,,"Johann Caspar Schade",,,,,,German,,
"Ach Gott, in was fuer Schmerzen","Ach Gott, in was fuer Schmerzen",ach_gott_in_was_fuer_schmerzen,"Das kleine Davidische Psalterspiel der Kinder Zions",DDPK1781,aa5,,,,,,,,,German,,
"Ach Gott, mich drueckt ein schwerer Stein","Ach Gott, mich drueckt ein schwerer Stein",ach_gott_mich_drueckt_ein_schwerer_stein,"Das kleine Davidische Psalterspiel der Kinder Zions",DDPK1781,aa6,,,"Laurentius Laurenti",,,,,,German,,
"Ach Gott, wie manches Herzeleid begegnet mir","Ach Gott, wie manches Herzeleid begegnet mir",ach_gott_wie_manches_herzeleid,"Das kleine Davidische Psalterspiel der Kinder Zions",DDPK1781,aa7,,,"Martin Moeller",,,,,,German,,
"Ach Herr Jesu, sei uns freundlich","Ach Herr Jesu, sei uns freundlich",ach_herr_jesu_sei_uns_freundlich,"Das kleine Davidische Psalterspiel der Kinder Zions",DDPK1781,aa8,,,,,,,,,German,,
"Ach Herr, wie duerstet meine Seele","Ach Herr, wie duerstet meine Seele",ach_herr_wie_duerstet_meine_seele,"Das kleine Davidische Psalterspiel der Kinder Zions",DDPK1781,aa9,,,"Joachim Neander",,,,,,German,,
"Ach Herzensgeliebte, wir scheiden jetzunder","Ach Herzensgeliebte, wir scheiden jetzunder",ach_herzensgeliebte_wir_scheiden_jetzund,"Das kleine Davidische Psalterspiel der Kinder Zions",DDPK1781,aa528,,,,,,,,,German,,
"Ach, hoer' das suesse Lallen","Ach, hoer' das suesse Lallen",ach_hoer_das_suesse_lallen,"Das kleine Davidische Psalterspiel der Kinder Zions",DDPK1781,ad1,,,"Jodocus van Lodenstein",,,,,,German,,
"Ach Jesu, mein Schoenster, erquicke mich Armen","Ach Jesu, mein Schoenster, erquicke mich Armen",ach_jesu_mein_schoenster_erquicke_mich_a,"Das kleine Davidische Psalterspiel der Kinder Zions",DDPK1781,aa10,,,,,,,,,German,,
"Ach Jesu, schau hernieder","Ach Jesu, schau hernieder",ach_jesu_schau_hernieder,"Das kleine Davidische Psalterspiel der Kinder Zions",DDPK1781,aa11,,,,,,,,,German,,
"Ach komm, Du suesser Herzens-Gast","Ach komm, Du suesser Herzens-Gast",ach_komm_du_suesser_herzensgast,"Das kleine Davidische Psalterspiel der Kinder Zions",DDPK1781,aa12,,,"Lueder Mencken",,,,,,German,,
"Ach komm, Du suesser Herzens-Gast","Ach komm, Du suesser Herzens-Gast",ach_komm_du_suesser_herzensgast,"Das kleine Davidische Psalterspiel der Kinder Zions",DDPK1781,ad2,,,"Lueder Mencken",,,,,,German,,
"Ach! lass Dich jetzt finden, Komm, Jesu, komm","Ach! lass Dich jetzt finden, Komm, Jesu, komm",ach_lass_dich_jetzt_finden,"Das kleine Davidische Psalterspiel der Kinder Zions",DDPK1781,aa13,,,,,,,,,German,,
"Ach! lass Dich jetzt finden, Komm, Jesu, komm","Ach! lass Dich jetzt finden, Komm, Jesu, komm",ach_lass_dich_jetzt_finden,"Das kleine Davidische Psalterspiel der Kinder Zions",DDPK1781,ad3,,,,,,,,,German,,
"Ach liebester Jesu, sieh auf mich","Ach liebester Jesu, sieh auf mich",ach_liebester_jesu_sieh_auf_mich,"Das kleine Davidische Psalterspiel der Kinder Zions",DDPK1781,aa14,,,,,,,,,German,,
"Ach, mein Gott, wie lieblich ist Deine Wohung","Ach, mein Gott, wie lieblich ist Deine Wohung",ach_mein_gott_wie_lieblich_ist_deine_woh,"Das kleine Davidische Psalterspiel der Kinder Zions",DDPK1781,aa15,,,,,,,,,German,,
"Ach, mein Jesu, sieh ich trete","Ach, mein Jesu, sieh ich trete",ach_mein_jesu_sieh_ich_trete,"Das kleine Davidische Psalterspiel der Kinder Zions",DDPK1781,aa16,,,,,,,,,German,,
"Ach moecht ich meinen Jesum sehen","Ach moecht ich meinen Jesum sehen",ach_moecht_ich_meinen_jesum_sehen,"Das kleine Davidische Psalterspiel der Kinder Zions",DDPK1781,aa17,,,,,,,,,German,,
"Ach moecht ich noch auf dieser Erden","Ach moecht ich noch auf dieser Erden",ach_moecht_ich_noch_auf_dieser_erden,"Das kleine Davidische Psalterspiel der Kinder Zions",DDPK1781,aa18,,,,,,,,,German,,
"Ach, sagt mir nichts von Gold und Sch'tzen","Ach, sagt mir nichts von Gold und Sch'tzen",ach_sagt_mir_nichts_von_gold_und_schatze,"Das kleine Davidische Psalterspiel der Kinder Zions",DDPK1781,aa19,,,"Johann Scheffler",,,,,,German,,
"Ach schone doch! o grosser Menschen-Hueter","Ach schone doch! o grosser Menschen-Hueter",ach_schone_doch_o_grosser_menschenhueter,"Das kleine Davidische Psalterspiel der Kinder Zions",DDPK1781,aa20,,,"Joachim Neander",,,,,,German,,
"Ach sei gewarnt, o Seel' vor Schaden, dass dir","Ach sei gewarnt, o Seel' vor Schaden, dass dir",ach_sei_gewarnt_o_seel_vor_schaden,"Das kleine Davidische Psalterspiel der Kinder Zions",DDPK1781,aa21,,,,,,,,,German,,
"Ach treib aus meiner Seel","Ach treib aus meiner Seel",ach_treib_aus_meiner_seel,"Das kleine Davidische Psalterspiel der Kinder Zions",DDPK1781,aa22,,,,,,,,,German,,
"Ach, treuer Gott, barmerzig's Herz, des Guete","Ach, treuer Gott, barmerzig's Herz, des Guete",ach_treuer_gott_barmerzigs_herz_des_guet,"Das kleine Davidische Psalterspiel der Kinder Zions",DDPK1781,aa23,,,"Paul Gerhardt",,,,,,German,,
"Ach treuer Gott, wie noethig ist, dass wir jetzt","Ach treuer Gott, wie noethig ist, dass wir jetzt",ach_treuer_gott_wie_noethig_ist_dass_wir,"Das kleine Davidische Psalterspiel der Kinder Zions",DDPK1781,aa24,,,,,,,,,German,,
"Ach, wachet, wachet auf, es sind die letzten Zeit","Ach, wachet, wachet auf, es sind die letzten Zeit",ach_wachet_wachet_auf_es_sind_die_letzte,"Das kleine Davidische Psalterspiel der Kinder Zions",DDPK1781,aa25,,,"Joachim Neander",,,,,,German,,
"Ach, wann werd ich schauen Dich","Ach, wann werd ich schauen Dich",ach_wann_werd_ich_schauen_dich,"Das kleine Davidische Psalterspiel der Kinder Zions",DDPK1781,aa30,,,"Ahasverus Fritsch",,,,,,German,,
"Ach, wann willst Du, Jesu, kommen","Ach, wann willst Du, Jesu, kommen",ach_wann_willst_du_jesu_kommen,"Das kleine Davidische Psalterspiel der Kinder Zions",DDPK1781,aa26,,,,,,,,,German,,
"Ach was bin ich, mein Erretterer","Ach was bin ich, mein Erretterer",ach_was_bin_ich_mein_erretterer,"Das kleine Davidische Psalterspiel der Kinder Zions",DDPK1781,aa27,,,,,,,,,German,,
"Ach, was mach ich in den St'dten","Ach, was mach ich in den St'dten",ach_was_mach_ich_in_den_stdten,"Das kleine Davidische Psalterspiel der Kinder Zions",DDPK1781,aa28,,,,,,,,,German,,
"Ach, was sind wir ohne Jesu! duerftig,","Ach, was sind wir ohne Jesu! duerftig,",ach_was_sind_wir_ohne_jesu,"Das kleine Davidische Psalterspiel der Kinder Zions",DDPK1781,aa29,,,,,,,,,German,,
"Ach wie so lieblich und so fein","Ach wie so lieblich und so fein",ach_wie_so_lieblich_und_so_fein,"Das kleine Davidische Psalterspiel der Kinder Zions",DDPK1781,aa31,,,,,,,,,German,,
"Ade, du suesse Welt! ich schwing ins Himmelszelt","Ade, du suesse Welt! ich schwing ins Himmelszelt",ade_du_suesse_welt_ich_schwing_ins_himme,"Das kleine Davidische Psalterspiel der Kinder Zions",DDPK1781,aa32,,,"Heinrich Mueller",,,,,,German,,
"Alle Menschen muessen sterben","Alle Menschen muessen sterben",alle_menschen_mussen_sterben,"Das kleine Davidische Psalterspiel der Kinder Zions",DDPK1781,aa35,,,,,,,,,German,,
"Allein Gott in der Hoeh sei Ehr, und Dank fuer seine Gnade","Allein Gott in der Hoeh sei Ehr, und Dank fuer seine Gnade",allein_gott_in_der_hoh_sei_ehr_decius,"Das kleine Davidische Psalterspiel der Kinder Zions",DDPK1781,aa33,,,"Nikolaus Decius",,,,,,German,,
"Allein, und doch nicht ganz alleine","Allein, und doch nicht ganz alleine",allein_und_doch_nicht_ganz_alleine,"Das kleine Davidische Psalterspiel der Kinder Zions",DDPK1781,aa34,,,"Benjamin Schmolk",,,,,,German,,
"Allgenugsam Wesen, das ich mir erlesen","Allgenugsam Wesen, das ich mir erlesen",allgenugsam_wesen_das_ich_mir_erlesen,"Das kleine Davidische Psalterspiel der Kinder Zions",DDPK1781,aa36,,,"Gerhard Tersteegen",,,,,,German,,
"Als Christus mit seiner wahren Lehr","Als Christus mit seiner wahren Lehr",als_christus_mit_seiner_wahren_lehr,"Das kleine Davidische Psalterspiel der Kinder Zions",DDPK1781,aa37,,,"Michael Sattler",,,,,,German,,
"An Jesum denken oft und viel","An Jesum denken oft und viel",an_jesum_denken_oft_und_viel,"Das kleine Davidische Psalterspiel der Kinder Zions",DDPK1781,aa38,,,,,,,,,German,,
"Auf, auf mein Geist, und du, o mein Gemuethe","Auf, auf mein Geist, und du, o mein Gemuethe",auf_auf_mein_geist_und_du_o_mein_gemueth,"Das kleine Davidische Psalterspiel der Kinder Zions",DDPK1781,aa39,,,"Johann Scheffler",,,,,,German,,
"Auf, Christen Mensch, auf, auf, zum Streit","Auf, Christen Mensch, auf, auf, zum Streit",auf_christenmensch_auf_auf_zum_streit,"Das kleine Davidische Psalterspiel der Kinder Zions",DDPK1781,aa40,,,"Johann Scheffler",,,,,,German,,
"Auf diesen Tag bedenken wir","Auf diesen Tag bedenken wir",auf_diesen_tag_bedenken_wir,"Das kleine Davidische Psalterspiel der Kinder Zions",DDPK1781,aa41,,,"Johann Zwick",,,,,,German,,
"Auf, hinauf zu deiner Freude","Auf, hinauf zu deiner Freude",auf_hinauf_zu_deiner_freude,"Das kleine Davidische Psalterspiel der Kinder Zions",DDPK1781,aa42,,,"Johann Caspar Schade",,,,,,German,,
"Auf, ihr Christen, Christi Glieder","Auf, ihr Christen, Christi Glieder",auf_ihr_christen_christi_glieder,"Das kleine Davidische Psalterspiel der Kinder Zions",DDPK1781,aa43,,,"Justus Falckner",,,,,,German,,
"Auf, ihr Christen, lasst uns singen","Auf, ihr Christen, lasst uns singen",auf_ihr_christen_lasst_uns_singen,"Das kleine Davidische Psalterspiel der Kinder Zions",DDPK1781,aa44,,,"Johann Christoph Arnschwanger",,,,,,German,,
"Auf Leiden folgt die Herrlichkeit","Auf Leiden folgt die Herrlichkeit",auf_leiden_folgt_die_herrlichkeit,"Das kleine Davidische Psalterspiel der Kinder Zions",DDPK1781,aa45,,,"Peter Lackmann",,,,,,German,,
"Auf meinen lieben Gott","Auf meinen lieben Gott",auf_meinen_lieben_gott,"Das kleine Davidische Psalterspiel der Kinder Zions",DDPK1781,aa46,,,"Sigismund Weingaertner",,,,,,German,,
"Auf Seele, auf, und s'ume nicht","Auf Seele, auf, und s'ume nicht",auf_seele_auf_und_saume_nicht,"Das kleine Davidische Psalterspiel der Kinder Zions",DDPK1781,aa47,,,"Michael Mueller",,,,,,German,,
"Auf, Seele, sei gerueft","Auf, Seele, sei gerueft",auf_seele_sei_gerueft,"Das kleine Davidische Psalterspiel der Kinder Zions",DDPK1781,aa48,,,,,,,,,German,,
"Auf, Triumph, es kommt die Stunde","Auf, Triumph, es kommt die Stunde",auf_triumph_es_kommt_die_stunde,"Das kleine Davidische Psalterspiel der Kinder Zions",DDPK1781,aa49,,,"Ernst Lange",,,,,,German,,
"Aus der tiefen Gruft","Aus der tiefen Gruft",aus_der_tiefen_gruft,"Das kleine Davidische Psalterspiel der Kinder Zions",DDPK1781,aa50,,,,,,,,,German,,
"Aus Lieb verwundter Jesu mein","Aus Lieb verwundter Jesu mein",aus_lieb_verwundter_jesu_mein,"Das kleine Davidische Psalterspiel der Kinder Zions",DDPK1781,aa51,,,,,,,,,German,,
"Befiehl du deine Wege, und wass dein Herze kr'nkt","Befiehl du deine Wege, und wass dein Herze kr'nkt",befiehl_du_deine_wege_und_was_dein_herze,"Das kleine Davidische Psalterspiel der Kinder Zions",DDPK1781,aa52,,,"Paul Gerhardt",,,,,,German,,
"Befiehl mein Herze, deine Wege alleine dem","Befiehl mein Herze, deine Wege alleine dem",befiehl_mein_herze_deine_wege_alleine_de,"Das kleine Davidische Psalterspiel der Kinder Zions",DDPK1781,ad4,,,,,,,,,German,,
"Beglueckter Stand getreuer Seelen, die Gott","Beglueckter Stand getreuer Seelen, die Gott",beglueckter_stand_getreuer_seelen_die_go,"Das kleine Davidische Psalterspiel der Kinder Zions",DDPK1781,aa53,,,"Ulrich Bogislaus von Bonin",,,,,,German,,
"Berufne Seelen, schlaftet nicht","Berufne Seelen, schlaftet nicht",berufne_seelen_schlafet_nicht,"Das kleine Davidische Psalterspiel der Kinder Zions",DDPK1781,aa542,,,"Gerhard Tersteegen",,,,,,German,,
"Bewahre dich, o Seel', dass du nicht abgefuehret","Bewahre dich, o Seel', dass du nicht abgefuehret",bewahre_dich_o_seel_dass_du_nicht_abgefu,"Das kleine Davidische Psalterspiel der Kinder Zions",DDPK1781,aa54,,,,,,,,,German,,
"Beweg mein Herz durch deine Kraft","Beweg mein Herz durch deine Kraft",beweg_mein_herz_durch_deine_kraft,"Das kleine Davidische Psalterspiel der Kinder Zions",DDPK1781,aa55,,,,,,,,,German,,
"Binde meine Seele wohl","Binde meine Seele wohl",binde_meine_seele_wohl,"Das kleine Davidische Psalterspiel der Kinder Zions",DDPK1781,aa56,,,,,,,,,German,,
"Bist du denn, Jesu, mit deiner Huelf'","Bist du denn, Jesu, mit deiner Huelf'",bist_du_denn_jesu_mit_deiner_huelf,"Das kleine Davidische Psalterspiel der Kinder Zions",DDPK1781,aa57,,,"Joachim Neander",,,,,,German,,
"Bleibe bei mir, liebster [treuer] Freund","Bleibe bei mir, liebster [treuer] Freund",bleibe_bei_mir_liebster_freund,"Das kleine Davidische Psalterspiel der Kinder Zions",DDPK1781,aa58,,,"C. Schuetz",,,,,,German,,
"Bleibe bei mir, liebster [treuer] Freund","Bleibe bei mir, liebster [treuer] Freund",bleibe_bei_mir_liebster_freund,"Das kleine Davidische Psalterspiel der Kinder Zions",DDPK1781,aa59,,,"C. Schuetz",,,,,,German,,
"Blicke meine Seele an","Blicke meine Seele an",blicke_meine_seele_an,"Das kleine Davidische Psalterspiel der Kinder Zions",DDPK1781,aa60,,,"Joachim Neander",,,,,,German,,
"Brich an, mein Licht, entzieh' dich nimmer nicht","Brich an, mein Licht, entzieh' dich nimmer nicht",brich_an_mein_licht_entzieh_dich_nimmer_,"Das kleine Davidische Psalterspiel der Kinder Zions",DDPK1781,aa61,,,"Gottfried Arnold",,,,,,German,,
"Brich endlich herfuer [hervor], du gehemmete Flut","Brich endlich herfuer [hervor], du gehemmete Flut",brich_endlich_herfuer_hervor_du_gehemmet,"Das kleine Davidische Psalterspiel der Kinder Zions",DDPK1781,aa62,,,"Gottfried Arnold",,,,,,German,,
"Brunn alles Heils, Dich ehren wir","Brunn alles Heils, Dich ehren wir",brunn_alles_heils_dich_ehren_wir,"Das kleine Davidische Psalterspiel der Kinder Zions",DDPK1781,ad5,,,"Gerhard Tersteegen",,,,,,German,,
"Brunnquell aller Gueter","Brunnquell aller Gueter",brunnquell_aller_gueter,"Das kleine Davidische Psalterspiel der Kinder Zions",DDPK1781,aa63,,,"Johann Franck",,,,,,German,,
"Christe, mein Leben, mein Hoffen, mein Glauben","Christe, mein Leben, mein Hoffen, mein Glauben",christe_mein_leben_mein_hoffen_mein_glau,"Das kleine Davidische Psalterspiel der Kinder Zions",DDPK1781,aa529,,,"J. W. Kellner von Zinnendorf",,,,,,German,,
"Christi Tod ist Adams Leben","Christi Tod ist Adams Leben",christi_tod_ist_adams_leben,"Das kleine Davidische Psalterspiel der Kinder Zions",DDPK1781,aa64,,,"Abraham Frankenberg",,,,,,German,,
"Christum wir sollen loben schon, der reinen","Christum wir sollen loben schon, der reinen",christum_wir_sollen_loben_schon,"Das kleine Davidische Psalterspiel der Kinder Zions",DDPK1781,aa66,,,"Coelius Sedulius; Martin Luther",,,,,,German,,
"Christus lag in Todes-Banden [todesbanden]","Christus lag in Todes-Banden [todesbanden]",christ_lag_in_todesbanden,"Das kleine Davidische Psalterspiel der Kinder Zions",DDPK1781,aa65,,,,,,,,,German,,
"Danke dem Herren, o Seele, dem Ursprung","Danke dem Herren, o Seele, dem Ursprung",danke_dem_herren_o_seele_dem_ursprung,"Das kleine Davidische Psalterspiel der Kinder Zions",DDPK1781,aa67,,,"Gerhard Tersteegen",,,,,,German,,
"Dankt dem Herrn, ihr Gottes knechte","Dankt dem Herrn, ihr Gottes knechte",dankt_dem_herrn_ihr_gottesknechte,"Das kleine Davidische Psalterspiel der Kinder Zions",DDPK1781,aa68,,,,,,,,,German,,
"Das Leben Jesu ist ein Licht","Das Leben Jesu ist ein Licht",das_leben_jesu_ist_ein_licht,"Das kleine Davidische Psalterspiel der Kinder Zions",DDPK1781,aa69,,,,,,,,,German,,
"Das Leben Jesu war zur Zeit","Das Leben Jesu war zur Zeit",das_leben_jesu_war_zur_zeit,"Das kleine Davidische Psalterspiel der Kinder Zions",DDPK1781,aa70,,,,,,,,,German,,
"Dein Blut, Herr, ist mein Element","Dein Blut, Herr, ist mein Element",dein_blut_herr_ist_mein_element,"Das kleine Davidische Psalterspiel der Kinder Zions",DDPK1781,aa71,,,"Gottfried Arnold",,,,,,German,,
"Dein Erbe, Herr, liegt vor dir hier und will im","Dein Erbe, Herr, liegt vor dir hier und will im",dein_erbe_herr_liegt_vor_dir_hier_und_wi,"Das kleine Davidische Psalterspiel der Kinder Zions",DDPK1781,aa72,,,"Gottfried Arnold",,,,,,German,,
"Dem Herren der Erdkireiss zusteht","Dem Herren der Erdkireiss zusteht",dem_herren_der_erdkreis_zusteht,"Das kleine Davidische Psalterspiel der Kinder Zions",DDPK1781,aa514,,,,,,,,,German,,
"Den am Kreuz,ich nur erw'hle","Den am Kreuz,ich nur erw'hle",den_am_kreuzich_nur_erwhle,"Das kleine Davidische Psalterspiel der Kinder Zions",DDPK1781,aa73,,,,,,,,,German,,
"Den meine Seele liebt, hat gar nicht seines Gleichen","Den meine Seele liebt, hat gar nicht seines Gleichen",den_meine_seele_liebt_hat_gar_nicht_sein,"Das kleine Davidische Psalterspiel der Kinder Zions",DDPK1781,aa74,,,,,,,,,German,,
"Den Wundre-Gott, den Wunder-Gott, der uns","Den Wundre-Gott, den Wunder-Gott, der uns",den_wundregott_den_wundergott_der_uns,"Das kleine Davidische Psalterspiel der Kinder Zions",DDPK1781,aa75,,,,,,,,,German,,
"Der Abend kommit, die Sonne sich verdecket und a","Der Abend kommit, die Sonne sich verdecket und a",der_abend_kommt_die_sonne_sich_verdecke,"Das kleine Davidische Psalterspiel der Kinder Zions",DDPK1781,ad6,,,"Gerhard Tersteegen",,,,,,German,,
"Der alles fuellt, vor dem die Tiefen zittern","Der alles fuellt, vor dem die Tiefen zittern",der_alles_fuellt_vor_dem_die_tiefen_zitt,"Das kleine Davidische Psalterspiel der Kinder Zions",DDPK1781,ad7,,,"Johann Daniel Herrnschmidt",,,,,,German,,
"Der am Creutz ist meine Liebe","Der am Creutz ist meine Liebe",der_am_kreuz_ist_meine_liebe_meine,"Das kleine Davidische Psalterspiel der Kinder Zions",DDPK1781,aa76,,,,,,,,,German,,
"Der Br'ut'gam kommt, der Br'ut'gam kommt","Der Br'ut'gam kommt, der Br'ut'gam kommt",der_brutgam_kommt_der_brutgam_kommt,"Das kleine Davidische Psalterspiel der Kinder Zions",DDPK1781,aa77,,,"Johann Scheffler",,,,,,German,,
"Der Creuzes- Dorn bringt Rosen","Der Creuzes- Dorn bringt Rosen",der_kreuzesdorn_bringt_rosen,"Das kleine Davidische Psalterspiel der Kinder Zions",DDPK1781,aa546f,,,,,,,,,German,,
"Der Gnaden-Brunn fleust noch","Der Gnaden-Brunn fleust noch",der_gnadenbrunn_fliesst_noch,"Das kleine Davidische Psalterspiel der Kinder Zions",DDPK1781,aa78,,,,,,,,,German,,
"Der Herr ist mein getreuer Hirt","Der Herr ist mein getreuer Hirt",der_herr_ist_mein_getreuer_hirt_halt,"Das kleine Davidische Psalterspiel der Kinder Zions",DDPK1781,aa79,,,,,,,,,German,,
"Der lieben Sonnen Licht und Pracht","Der lieben Sonnen Licht und Pracht",der_lieben_sonnen_licht_und_pracht,"Das kleine Davidische Psalterspiel der Kinder Zions",DDPK1781,aa80,,,,,,,,,German,,
"Der lieben Sonnen Licht und Pracht","Der lieben Sonnen Licht und Pracht",der_lieben_sonnen_licht_und_pracht,"Das kleine Davidische Psalterspiel der Kinder Zions",DDPK1781,aa81,,,,,,,,,German,,
"Der schmale Weg ist breitgenug zum Leben","Der schmale Weg ist breitgenug zum Leben",der_schmale_weg_ist_breit_genug_zum_lebe,"Das kleine Davidische Psalterspiel der Kinder Zions",DDPK1781,aa530,,,,,,,,,German,,
"Der Tag ist hin, mein Jesu!","Der Tag ist hin, mein Jesu!",der_tag_ist_hin_mein_jesu_bei_mir,"Das kleine Davidische Psalterspiel der Kinder Zions",DDPK1781,aa82,,,,,,,,,German,,
"Der Tag ist hin mit seinem Lichte","Der Tag ist hin mit seinem Lichte",der_tag_ist_hin_mit_seinem_lichte,"Das kleine Davidische Psalterspiel der Kinder Zions",DDPK1781,aa83,,,,,,,,,German,,
"Der Weißheit Licht gläntzt immerzu","Der Weißheit Licht gläntzt immerzu",der_weissheit_licht_glantzt_immerzu,"Das kleine Davidische Psalterspiel der Kinder Zions",DDPK1781,aa84,,,,,,,,,German,,
"Die Freundlichkeit meines Geliebten mich rühret","Die Freundlichkeit meines Geliebten mich rühret",die_freundlichkeit_meines_geliebten_mich,"Das kleine Davidische Psalterspiel der Kinder Zions",DDPK1781,aa85,,,,,,,,,German,,
"Die Gottliche Liebe bringt lauter Vergnügen","Die Gottliche Liebe bringt lauter Vergnügen",die_gottliche_liebe_bringt_lauter_vergnu,"Das kleine Davidische Psalterspiel der Kinder Zions",DDPK1781,aa86,,,,,,,,,German,,
"Die Lieb ist kalt zetzt in der Welt","Die Lieb ist kalt zetzt in der Welt",die_lieb_ist_kalt_jezt_in_der_welt,"Das kleine Davidische Psalterspiel der Kinder Zions",DDPK1781,aa89,,,,,,,,,German,,
"Die Liebe leidet nicht Gesellen","Die Liebe leidet nicht Gesellen",die_liebe_leidet_nich_gesellen,"Das kleine Davidische Psalterspiel der Kinder Zions",DDPK1781,aa87,,,,,,,,,German,,
"Die Liebe, so niedrigen Dingen entgehet","Die Liebe, so niedrigen Dingen entgehet",die_liebe_so_niedrigen_dingen_entgehet,"Das kleine Davidische Psalterspiel der Kinder Zions",DDPK1781,aa88,,,,,,,,,German,,
"Die liebliche Blicke, die Jesus mir giebt","Die liebliche Blicke, die Jesus mir giebt",die_liebliche_blicke_die_jesus_mir_giebt,"Das kleine Davidische Psalterspiel der Kinder Zions",DDPK1781,aa90,,,,,,,,,German,,
"Die Macht der Warheit bricht herfür","Die Macht der Warheit bricht herfür",die_macht_der_warheit_bricht_herfur,"Das kleine Davidische Psalterspiel der Kinder Zions",DDPK1781,aa91,,,,,,,,,German,,
"Die Morgensterne loben Gott","Die Morgensterne loben Gott",die_morgensterne_loben_gott,"Das kleine Davidische Psalterspiel der Kinder Zions",DDPK1781,aa92,,,,,,,,,German,,
"Die Nacht ist vor der Thür","Die Nacht ist vor der Thür",die_nacht_ist_vor_der_thur,"Das kleine Davidische Psalterspiel der Kinder Zions",DDPK1781,aa93,,,,,,,,,German,,
"Die Seele Christi heilge mich","Die Seele Christi heilge mich",die_seele_christi_heilge_mich,"Das kleine Davidische Psalterspiel der Kinder Zions",DDPK1781,aa94,,,,,,,,,German,,
"Die Tugend wird durchs Creuz geubet","Die Tugend wird durchs Creuz geubet",die_tugend_wird_durchs_kreuz_geubet,"Das kleine Davidische Psalterspiel der Kinder Zions",DDPK1781,aa95,,,,,,,,,German,,
"Die Zeit ist noch nicht da","Die Zeit ist noch nicht da",die_zeit_ist_noch_nicht_da,"Das kleine Davidische Psalterspiel der Kinder Zions",DDPK1781,aa96,,,,,,,,,German,,
"Die Zions Gesellen, die mussen stets wachen","Die Zions Gesellen, die mussen stets wachen",die_zions_gesellen_die_mussen_stets_wach,"Das kleine Davidische Psalterspiel der Kinder Zions",DDPK1781,aa97,,,,,,,,,German,,
"Dir, dir, Jehova, will ich singen","Dir, dir, Jehova, will ich singen",dir_dir_jehovah_will_ich_singen,"Das kleine Davidische Psalterspiel der Kinder Zions",DDPK1781,aa98,,,"Bartholomaeus Crasselius",,,,,,German,,
"Dir sei Lob, Herrlichkeit und Preis","Dir sei Lob, Herrlichkeit und Preis",dir_sei_lob_herrlichkeit_und_preis,"Das kleine Davidische Psalterspiel der Kinder Zions",DDPK1781,aa99,,,,,,,,,German,,
"Diß ein das noth, Lehr mich","Diß ein das noth, Lehr mich",diss_ein_das_noth_lehr_mich,"Das kleine Davidische Psalterspiel der Kinder Zions",DDPK1781,aa100,,,,,,,,,German,,
"Du Aufgang aus der hoehe","Du Aufgang aus der hoehe",du_aufgang_aus_der_hoehe,"Das kleine Davidische Psalterspiel der Kinder Zions",DDPK1781,ad8,,,,,,,,,German,,
"Du Geist, der alle Frommen fuehrt","Du Geist, der alle Frommen fuehrt",du_geist_der_alle_frommen_fuehrt,"Das kleine Davidische Psalterspiel der Kinder Zions",DDPK1781,aa101,,,,,,,,,German,,
"Du gruener Zweig, du edles Reis","Du gruener Zweig, du edles Reis",du_gruener_zweig_du_edles_reis,"Das kleine Davidische Psalterspiel der Kinder Zions",DDPK1781,aa102,,,"Johann Scheffler",,,,,,German,,