displayTitle,firstLine,textAuthNumber,hymnalTitle,hymnalID,number,textTitle,refrainFirstLine,authors,composers,meter,tuneTitle,tuneAuthNumber,incipit,languages,textSources,tuneSources
"Psalm 1","Blessed are they who listen not to evil counsel",blessed_are_they_who_listen_not_to_evil,"Christadelphian Hymn Book: for worship and for witness",CHB2002,1,"Psalm 1",,"Paul Wigmore","John Barnard",,"COLN ROGERS",coln_rogers_barnard,12345653341234517656,English,,
"Psalm 5","Give ear to my words, O Lord",give_ear_to_my_words_o_lord_consider_my,"Christadelphian Hymn Book: for worship and for witness",CHB2002,2,"Psalm 5",,"Marie McCrone","Marie McCrone",,"[Give ear to my words, O Lord]",give_ear_to_my_words_mccrone,,English,,
"Psalm 5","Lead me, Lord, lead me in Thy righteousness",lead_me_lord_lead_me_in_thy_right,"Christadelphian Hymn Book: for worship and for witness",CHB2002,3,"Psalm 5",,,"Samuel Sebastian Wesley",,"LEAD ME, LORD",lead_me_lord_wesley,321432133253212,English,,
"Psalm 5","My voice shalt Thou hear in the morning, O Lord",my_voice_shalt_thou_hear_in_the_morning,"Christadelphian Hymn Book: for worship and for witness",CHB2002,4,"Psalm 5",,,"John Goss (1800-1880)",,"MY VOICE SHALT THOU HEAR",my_voice_shalt_thou_hear_goss,,English,,
"Psalm 8","O Lord, our Lord, how excellent Thy name on earth is known",o_lord_our_king_how_excellent,"Christadelphian Hymn Book: for worship and for witness",CHB2002,5,"Psalm 8",,"James Montgomery (1771-1854)","John Bacchus Dykes",,BEATITUDO,beatitudo_dykes,123531436713222,English,,"Psalm 8"
"Psalm 9","Lord, Thee I'll praise with all my heart",lord_thee_ill_praise_with_all_my_heart_t,"Christadelphian Hymn Book: for worship and for witness",CHB2002,6,"Psalm 9",,,"Thomas Ravenscroft",,DAVID,david,,English," <cite>The Scottish Psalter</cite>","The Psalter of 1612"
"Psalm 9","The Lord will be a refuge for the oppressed",the_lord_will_be_a_refuge_for_the_oppres,"Christadelphian Hymn Book: for worship and for witness",CHB2002,7,"Psalm 9",,,"George James Webb",,"THE LORD WILL BE A REFUGE",the_lord_will_be_a_refuge_webb,,English,,
"Psalm 19","God's law is perfect, and converts The soul in sin that lies",gods_law_is_perfect_and_converts,"Christadelphian Hymn Book: for worship and for witness",CHB2002,8,"Psalm 19",,,,,"LONDON NEW",london_new_playford,153156175135215,English," <cite>The Scottish Psalter</cite>","'Scottish Psalter,' 1635."
"Psalm 23","The King of love my Shepherd is",the_king_of_love_my_shepherd_is,"Christadelphian Hymn Book: for worship and for witness",CHB2002,9,"Psalm 23",,"Henry Williams Baker (1821-1877)","John Bacchus Dykes",,"DOMINUS REGIT ME",dominus_regit_me_dykes,354332215567132,English,,
"Psalm 23","The Lord is my Shepherd, I shall not want",the_lord_is_my_shepherd_i_shall_not_chan,"Christadelphian Hymn Book: for worship and for witness",CHB2002,10,"Psalm 23",,,"Islip Collyer (1876-1953)",,"THE LORD IS MY SHEPHERD",the_lord_is_my_shepherd_collyer,,English,,
"Psalm 23","The Lord my Shepherd is, I shall be well supplied",the_lord_my_shepherd_is_i_shall_be_well_,"Christadelphian Hymn Book: for worship and for witness",CHB2002,11,"Psalm 23",,"Isaac Watts (1674-1748)",,,GREATHED,annue_christe_12333,112333234321113455,English,,"Melody (known as Annue Christe) from La Feillée's Méthode du plain-chant (1808)"
"Psalm 23","The Lord's my Shepherd, I'll not want",the_lords_my_shepherd_ill_not_want_rous,"Christadelphian Hymn Book: for worship and for witness",CHB2002,12,"Psalm 23",,"Francis Rous","J. S. Irvine",,CRIMOND,crimond_irvine,53425421713322445,English," <cite>The Scottish Psalter</cite>",
"Psalm 25","To Thee I lift my soul",to_thee_i_lift_my_soul_o_lord_i_trust_in,"Christadelphian Hymn Book: for worship and for witness",CHB2002,13,"Psalm 25",,"Cornelius Bryan (c. 1775-1840)","William Henry Havergal (1793-1870)",,FRANCONIA,franconia_konig,12345356143251765665,English,,"Based on a melody in König's Choralbuch (1738)"
"Psalm 27","God is my strong salvation",god_is_my_strong_salvation,"Christadelphian Hymn Book: for worship and for witness",CHB2002,14,"Psalm 27",,"James Montgomery (1771-1854)","Franz Joseph Haydn (1732-1809)",,BRADFORD,bradford_haydn,51721321123421751721,English,,
"Psalm 31","O love the Lord, O love the Lord, O love the Lord, all ye His saints",o_love_the_lord_o_love_the_lord_o_love,"Christadelphian Hymn Book: for worship and for witness",CHB2002,15,"Psalm 31",,,,,"O LOVE THE LORD",o_love_the_lord_34231,34231271232343,English,,
"Psalm 33","Our soul waiteth for the Lord",our_soul_waiteth_for_the_lord,"Christadelphian Hymn Book: for worship and for witness",CHB2002,16,"Psalm 33",,,,,"OUR SOUL WAITETH",our_soul_waiteth_anonymous,,English,,
"Psalm 34","O children, hither do ye come",o_children_hither_do_ye_come,"Christadelphian Hymn Book: for worship and for witness",CHB2002,17,"Psalm 34",,,"George Frederic Handel",,SOLOMON,solomon_handel,134556655657125665,English," <cite>Scottish Psalter</cite>",
"Psalm 34","O taste and see how gracious the Lord is",o_taste_and_see_how_gracious_the_lord_is,"Christadelphian Hymn Book: for worship and for witness",CHB2002,18,"Psalm 34",,,"John Goss (1800-1880)",,"O TASTE AND SEE HOW GRACIOUS THE LORD IS",o_taste_and_see_how_gracious_the_lord_is,,English,,
"Psalm 36","High in the heav'ns, eternal God",high_in_the_heavens_eternal_god,"Christadelphian Hymn Book: for worship and for witness",CHB2002,19,"Psalm 36",,"Isaac Watts (1674-1748)",,,PLAISTOW,plaistow,1523145652345,English,,"<i>Magdalen Hospital Hymns</i> (c. 1762)"
"Psalm 37","For evil-doers fret thu not",for_evildoers_fret_thou_not,"Christadelphian Hymn Book: for worship and for witness",CHB2002,20,"Psalm 37",,,"William Henry Havergal (1793-1870)",,EVAN,evan_havergal,55132165551312432,English," <cite>Scottish Psalter</cite>",
"Psalm 37","Rest in the Lord, and patiently",for_evildoers_fret_thou_not,"Christadelphian Hymn Book: for worship and for witness",CHB2002,21,"Psalm 37",,,"Walton, Colin R. G.",,QUEENS,queens_walton,,English,,
"Psalm 40","O blessed is the man whose trust",o_blessed_is_the_man_whose_trust,"Christadelphian Hymn Book: for worship and for witness",CHB2002,22,"Psalm 40",,,,,FABER,faber,,English," <cite>Scot­tish Psal­ter</cite>, 1635",
"Psalm 42","As pants the hart for cooling streams",as_pants_the_hart_for_cooling_strea_tate,"Christadelphian Hymn Book: for worship and for witness",CHB2002,23,"Psalm 42",,"Nahum Tate (1652-1712); Nicholas Brady (1659-1726)","Hugh Wilson (1766-1824)",,MARTYRDOM,martyrdom_wilson,51651232135321325321,English,,
"Psalm 42","As the hart panteth after the water brooks",as_the_hart_panteth_after_the_water_broo,"Christadelphian Hymn Book: for worship and for witness",CHB2002,24,"Psalm 42",,,"Lowell Mason (1792-1872)",,"AS THE HART PANTETH",as_the_hart_panteth,,English,,
"Psalm 43","O send Thy light forth and Thy truth",o_send_thy_light_forth_and_thy_truth,"Christadelphian Hymn Book: for worship and for witness",CHB2002,25,"Psalm 43",,"William Barton (1597-1678)","Isaac Smith (1725-1800)",,ARBRIDGE,abridge_smith,15117654332365545534,English,,
"Psalm 46","God is our refuge and our strength",god_is_our_refuge_and_our_strength_in_st,"Christadelphian Hymn Book: for worship and for witness",CHB2002,26,"Psalm 46",,,"John Bacchus Dykes",,GERONTIUS,gerontius_dykes,332151353211116,English," <cite>Scottish Psalter</cite>",
"Psalm 46","The heathen rage tumultously",god_is_our_refuge_where_were_safe,"Christadelphian Hymn Book: for worship and for witness",CHB2002,27,"Psalm 46",,,"Earl of Mornington (1735-1781)",,"MORNINGTON CHANT",mornington_mornington,554321176565434,English,,
"Psalm 48","Cry out and shout, thou inhabitant of Zion",cry_out_and_shout_thou_inhabitant_of_zio,"Christadelphian Hymn Book: for worship and for witness",CHB2002,28,"Psalm 48",,,"Philip P. Bliss (1838-1876)",,"CRY OUT AND SHOUT",cry_out_and_shout_bliss,13511765615325722176,English,,
"Psalm 51","After Thy loving kindness, Lord",after_thy_lovingkindness_lord,"Christadelphian Hymn Book: for worship and for witness",CHB2002,29,"Psalm 51",,"Edmund Prys (c. 1541-1624)","Richard Farrant (1530-1580)",,FARRANT,farrant_farrant,112321422345545,English,,
"Psalm 51","Throughly wash me",throughly_wash_me_throughly_wash_me,"Christadelphian Hymn Book: for worship and for witness",CHB2002,30,"Psalm 51",,,,,"THROUGHLY WASH ME",throughly_wash_me_mendelssohn,,English,,
"Psalm 55","Cast thy burden upon the Lord",cast_thy_burden_upon_the_lord_and_he_sha,"Christadelphian Hymn Book: for worship and for witness",CHB2002,31,"Psalm 55",,,"Felix Mendelssohn-Bartholdy",,"CAST THY BURDEN UPON THE LORD",cast_thy_burden_upon_the_mendelssohn,112366543355421,English,,"Melody from Meiningen Gesangbuch (1693)"
"Psalm 57","Be merciful to me, O God",be_merciful_to_me_o_god_thy_mercy_unto,"Christadelphian Hymn Book: for worship and for witness",CHB2002,32,"Psalm 57",,"Benjamin Hall Kennedy","Carl Gottlief Gläsen (1784-1890)",,DENFIELD,azmon_glaser,511223212334325,English,,
"Psalm 63","Lord, Thee my God, I'll early seek",lord_thee_my_god_ill_early_seek,"Christadelphian Hymn Book: for worship and for witness",CHB2002,33,"Psalm 63",,,,,"CREATOR GOD",creator_god_warren,56711223343231553332,English," <cite>Scottish Psalter</cite>",
"Psalm 64","The righteous shall be glad, be glad in the Lord",the_righteous_shall_be_glad_be_glad_in_t,"Christadelphian Hymn Book: for worship and for witness",CHB2002,34,"Psalm 64",,,,,"THE RIGHTEOUS SHALL BE GLAD",the_righteous_shall_be_glad,,English,,
"Psalm 65","O Thou that hearest pray'r",o_thou_that_hearest_prayer_o_thou_that,"Christadelphian Hymn Book: for worship and for witness",CHB2002,35,"Psalm 65",,,"Thomas Hastings (1784-1872)",,"O THOU THAT HEAREST PRAYER",o_thou_that_hearest_prayer_hastings,,English,,
"Psalm 66","If I regard iniquity in my heart",if_i_regard_iniquity_in_my_heart,"Christadelphian Hymn Book: for worship and for witness",CHB2002,36,"Psalm 66",,,"T. F. Seward",,"IF I REGARD INIQUITY IN MY HEART",if_i_regard_iniquity_in_my_heart_seward,,English,,
"Psalm 67","God be merciful unto us, and bless us",_,"Christadelphian Hymn Book: for worship and for witness",CHB2002,37,"Psalm 67",,,"Stones, Jospeh (1831-1899)",,"GOD BE MERCIFUL UNTO US",god_be_merciful_unto_us_stones,,English,,
"Psalm 67","God of mercy, God of grace, Show the brightness of Thy face",god_of_mercy_god_of_grace_show_the,"Christadelphian Hymn Book: for worship and for witness",CHB2002,38,"Psalm 67",,"Henry Francis Lyte (1793-1847)","Henry Smart (1813-1879)",,HEATHLANDS,heathlands_smart,517566542345432,English,,
"Psalm 72","O Lord, Thy judgements give the king, His Son Thy righteousness",o_lord_thy_judgments_give_the_king_his_s,"Christadelphian Hymn Book: for worship and for witness",CHB2002,39,"Psalm 72",,,"John Foster (1807-1885)",,CLAREMONT,claremont_foster,135117766535424,English," <cite>Scottish Psalter</cite>",
"Psalm 80","Turn us again, O Lord, our God, And upon us vouchsafe",hear_israels_shepherd_like_a_flock,"Christadelphian Hymn Book: for worship and for witness",CHB2002,40,"Psalm 80",,,"Thomas Wright",,STOCKTON,stockton_wright,134514322345451,English,,
"Psalm 84","How lovely is Your dwelling place, O Lord of hosts, to me",_,"Christadelphian Hymn Book: for worship and for witness",CHB2002,41,"Psalm 84",,,,,"LEAMINGTON SPA",_,,English,,
"Psalm 85, 86","The Lord will come, and not be slow, His footsetps cannot err",_,"Christadelphian Hymn Book: for worship and for witness",CHB2002,42,"Psalm 85, 86",,,,,BINCHESTER,_,,English,,
"Psalm 86","Comfort, O Lord, the soul of Thy servant, for unto Thee do I lift up my soul",_,"Christadelphian Hymn Book: for worship and for witness",CHB2002,43,"Psalm 86",,,,,"COMFORT THE SOUL OF THY SERVANT",_,,English,,
"Psalm 89","Blessed are the people that know the joyful sound",_,"Christadelphian Hymn Book: for worship and for witness",CHB2002,44,"Psalm 89",,,,,"BLESSED ARE THE PEOPLE",_,,English,,
"Psalm 90","Lord, Thou hast been our dwelling place In generations all",_,"Christadelphian Hymn Book: for worship and for witness",CHB2002,45,"Psalm 90",,,,,"ST. MATTHEW",_,,English,,
"Psalm 90","O God, our help in ages past, Our hope for years to come",_,"Christadelphian Hymn Book: for worship and for witness",CHB2002,46,"Psalm 90",,,,,"ST. ANNE",_,,English,,
"Psalm 93","Jehovah reigns, He dwells in light",_,"Christadelphian Hymn Book: for worship and for witness",CHB2002,47,"Psalm 93",,,,,MONTGOMERY,_,,English,,
"Psalm 96","O worship the Lord, O worship the Lord",_,"Christadelphian Hymn Book: for worship and for witness",CHB2002,48,"Psalm 96",,,,,"O WORSHIP THE LORD",_,,English,,
"Psalm 98","O sing a new song to the Lord, For wonders He hath done",_,"Christadelphian Hymn Book: for worship and for witness",CHB2002,49,"Psalm 98",,,,,"ROBINSON CHANT",_,,English,,
"Psalm 100","All people that on earth do dwell, Sing to the Lord with cheerful voice",_,"Christadelphian Hymn Book: for worship and for witness",CHB2002,50,"Psalm 100",,,,,"OLD HUNDREDETH",_,,English,,
"Psalm 102","O Thou, Jehovah, shalt endure From change and all mutation free",_,"Christadelphian Hymn Book: for worship and for witness",CHB2002,51,"Psalm 102",,,,,BRITISH,_,,English,,
"Psalm 103","Good is our God and full of kind compassion",_,"Christadelphian Hymn Book: for worship and for witness",CHB2002,52,"Psalm 103",,,,,"STRENGTH AND STAY",_,,English,,
"Psalm 104","The glory of the mighty Lord Continue shall for aye",_,"Christadelphian Hymn Book: for worship and for witness",CHB2002,53,"Psalm 104",,,,,"BON ACCORD",_,,English,,
"Psalm 106","Give praise and thanks unto the Lord, For beautiful is He",_,"Christadelphian Hymn Book: for worship and for witness",CHB2002,54,"Psalm 106",,,,,BEDFORD,_,,English,,
"Psalm 110","From Zion shall Thy rod proceed; The sword of judgement in Thy hand",_,"Christadelphian Hymn Book: for worship and for witness",CHB2002,55,"Psalm 110",,,,,WARRINGTON,_,,English,,
"Psalm 115","Eternal God, Thou only just, Thou only gracious, wise, and true",_,"Christadelphian Hymn Book: for worship and for witness",CHB2002,56,"Psalm 115",,,,,CAREY'S,_,,English,,
"Psalm 117","O praise the Lord, all ye nations",_,"Christadelphian Hymn Book: for worship and for witness",CHB2002,57,"Psalm 117",,,,,"O PRAISE THE LORD, ALL YE NATIONS",_,,English,,
"Psalm 119","Blessed are they that undefiled And straight are in Thy way",_,"Christadelphian Hymn Book: for worship and for witness",CHB2002,58,"Psalm 119",,,,,"DUBLIN C.M.",_,,English,,
"Psalm 119","O how love I Thy law, it is My study all the day",_,"Christadelphian Hymn Book: for worship and for witness",CHB2002,59,"Psalm 119",,,,,"WILTSHIRE C.M.",_,,English,,
"Psalm 121","Though to the hills I lift mine eyes, From whence doth come mine aid?",_,"Christadelphian Hymn Book: for worship and for witness",CHB2002,60,"Psalm 121",,,,,"SHEFFIELD C.M.",_,,English,,
"Psalm 122","Pray for the peace of Jerusalem; they shall prosper that love thee",_,"Christadelphian Hymn Book: for worship and for witness",CHB2002,61,"Psalm 122",,,,,"PRAY FOR THE PEACE OF JERUSALEM",_,,English,,
"Psalm 125","All they who in the Lord confide shall as Mount Zion be",_,"Christadelphian Hymn Book: for worship and for witness",CHB2002,62,"Psalm 125",,,,,"ALL THEY WHO IN THE LORD CONFIDE",_,,English,,
"Psalm 130","Out of the depths have I cried unto Thee, have I cried unto Thee, O Lord",_,"Christadelphian Hymn Book: for worship and for witness",CHB2002,63,"Psalm 130",,,,,"OUT OF THE DEPTHS",_,,English,,
"Psalm 132","The Lord in truth to David sware, He will not turn therefrom",_,"Christadelphian Hymn Book: for worship and for witness",CHB2002,64,"Psalm 132",,,,,"MAGNUS C.M.",_,,English,,
"Psalm 133","Behold, how good a thing it is, And how becoming well",_,"Christadelphian Hymn Book: for worship and for witness",CHB2002,65,"Psalm 133",,,,,"BELMONT C.M.",_,,English,,
"Psalm 139","Search me, O God, and know my heart; try me, and know my thoughts",_,"Christadelphian Hymn Book: for worship and for witness",CHB2002,66,"Psalm 139",,,,,"SEARCH ME, O GOD",_,,English,,
"Psalm 139","Where can we hide, or whither fly, Lord, to escape Thy piercing eye?",_,"Christadelphian Hymn Book: for worship and for witness",CHB2002,67,"Psalm 139",,,,,"SACRED STREAM L.M.",_,,English,,
"Psalm 145","I will extol Thee, my God, O King",_,"Christadelphian Hymn Book: for worship and for witness",CHB2002,68,"Psalm 145",,,,,"I WILL EXTOL THEE",_,,English,,
"Psalm 145","O Lord, Thou art my God and King, Thee will I magnify and praise",_,"Christadelphian Hymn Book: for worship and for witness",CHB2002,69,"Psalm 145",,,,,"MELCOMBE L.M.",_,,English,,
"Psalm 145","The Lord our God most gracious is, Compassion He delights to show",_,"Christadelphian Hymn Book: for worship and for witness",CHB2002,70,"Psalm 145",,,,,"WAREHAM L.M.",_,,English,,
"Psalm 145","The eyes of all things, Lord, attend, And on Thee wait, that here do live",_,"Christadelphian Hymn Book: for worship and for witness",CHB2002,71,"Psalm 145",,,,,"DUKE STREET L.M.",_,,English,,
"Psalm 148","Hallelujah! Yahweh's name From the hea'ns aloud proclaim!",_,"Christadelphian Hymn Book: for worship and for witness",CHB2002,72,"Psalm 148",,,,,HALLELUJAH,_,,English,,
"Psalm 148","Ye boundless realms of joy, Exalt your Maker's fame",_,"Christadelphian Hymn Book: for worship and for witness",CHB2002,73,"Psalm 148",,,,,"DARWALL'S 148th",_,,English,,
"Psalm 150","O praise God in His holiness; praise Him in the firmament of His pow'r",_,"Christadelphian Hymn Book: for worship and for witness",CHB2002,74,"Psalm 150",,,,,"O PRAISE GOD IN HIS HOLINESS",_,,English,,
"Psalm 150","O praise ye the Lord! Praise Him in the height",_,"Christadelphian Hymn Book: for worship and for witness",CHB2002,75,"Psalm 150",,,,,"LAUDAE DOMINUM",_,,English,,
"All creatures of our God and King, Lift up your voice and with us sing","All creatures of our God and King, Lift up your voice and with us sing",_,"Christadelphian Hymn Book: for worship and for witness",CHB2002,76,,,,,,"LASST UNS ERFREUEN",_,,English,,"The English Hymnal"
"All-pow'rful, self-existent God, Who all creation dost sustain!","All-pow'rful, self-existent God, Who all creation dost sustain!",_,"Christadelphian Hymn Book: for worship and for witness",CHB2002,77,,,,,,"CANADA L.M.",_,,English,,
"Amen. Blessing and glory, and wisdom and thanksgiving","Amen. Blessing and glory, and wisdom and thanksgiving",_,"Christadelphian Hymn Book: for worship and for witness",CHB2002,78,,,,,,"AMEN. BLESSING AND GLORY",_,,English,,
"Bright the vision that delighted Once the sight of Judah's seer","Bright the vision that delighted Once the sight of Judah's seer",_,"Christadelphian Hymn Book: for worship and for witness",CHB2002,79,,,,,,"LAUS DEO (Redhead 46)",_,,English,,
"Father and Friend, Thy light, Thy love","Father and Friend, Thy light, Thy love",_,"Christadelphian Hymn Book: for worship and for witness",CHB2002,80,,,,,,"SUBMISSION L.M.",_,,English,,
"Everlasting, changing never!","Everlasting, changing never!",_,"Christadelphian Hymn Book: for worship and for witness",CHB2002,81,,,,,,BENEDICTION,_,,English,,
"Fill Thou my life, O Lord, my God","Fill Thou my life, O Lord, my God",_,"Christadelphian Hymn Book: for worship and for witness",CHB2002,82,,,,,,"RICHMOND C.M.",_,,English,,
"Glory and blessing be Ever ascribed to Thee","Glory and blessing be Ever ascribed to Thee",_,"Christadelphian Hymn Book: for worship and for witness",CHB2002,83,,,,,,DOXOLOGY,_,,English,,
"God is love: His the care, Tending each, ev'rywhere","God is love: His the care, Tending each, ev'rywhere",_,"Christadelphian Hymn Book: for worship and for witness",CHB2002,84,,,,,,THEODORIC,_,,English,,
"God who cheered the faithful Joseph In his lone distress","God who cheered the faithful Joseph In his lone distress",_,"Christadelphian Hymn Book: for worship and for witness",CHB2002,85,,,,,,"DIVINE AID",_,,English,,
"God of Glory, Truth and Slendour","God of Glory, Truth and Slendour",_,"Christadelphian Hymn Book: for worship and for witness",CHB2002,86,,,,,,"LOVE DIVINE",_,,English,,
"Hallelujah! raise, O raise","Hallelujah! raise, O raise",_,"Christadelphian Hymn Book: for worship and for witness",CHB2002,87,,,,,,INNOCENTS,_,,English,,
"Great is Thy faithfulness!","Great is Thy faithfulness, O God my Father",_,"Christadelphian Hymn Book: for worship and for witness",CHB2002,88,,"Great is Thy faithfulness!",,,,"GREAT IS THY FAITHFULNESS",_,,English,,
"Hallelujah, God be honoured: True and righteous all His ways","Hallelujah, God be honoured: True and righteous all His ways",_,"Christadelphian Hymn Book: for worship and for witness",CHB2002,89,,,,,,"ABBOT'S LEIGH",_,,English,,
"Hark, my soul, how ev'rything Strives to sreve our bounteous King","Hark, my soul, how ev'rything Strives to sreve our bounteous King",_,"Christadelphian Hymn Book: for worship and for witness",CHB2002,90,,,,,,"ST. BEES",_,,English,,
"High over lashing waves our God is throned","High over lashing waves our God is throned",_,"Christadelphian Hymn Book: for worship and for witness",CHB2002,91,,,,,,"OLD 124th",_,,English,,
"Holy, holy, holy, Lord God of Hosts","Holy, holy, holy, Lord God of Hosts",_,"Christadelphian Hymn Book: for worship and for witness",CHB2002,92,,,,,,"HOLY, HOLY, HOLY",_,,English,,
"Honour and glory, dominion, pow'r be to Jehovah","Honour and glory, dominion, pow'r be to Jehovah",_,"Christadelphian Hymn Book: for worship and for witness",CHB2002,93,,,,,,"HONOUR AND GLORY",_,,English,,
"Immortal, invisible, God only wise, In light inaccessible hid from our eyes","Immortal, invisible, God only wise, In light inaccessible hid from our eyes",_,"Christadelphian Hymn Book: for worship and for witness",CHB2002,94,,,,,,"ST. DENIO",_,,English,,
"Infinite God, to Thee our voice we raise","Infinite God, to Thee our voice we raise",_,"Christadelphian Hymn Book: for worship and for witness",CHB2002,95,,,,,,"DEVOTION No. 2",_,,English,,
"Jehovah dwells alone, No equal can He see","Jehovah dwells alone, No equal can He see",_,"Christadelphian Hymn Book: for worship and for witness",CHB2002,96,,,,,,"SERENITY S.M.",_,,English,,
"Let all the world rejoice! The great Jehovah reigns","Let all the world rejoice! The great Jehovah reigns",_,"Christadelphian Hymn Book: for worship and for witness",CHB2002,97,,,,,,HERALD,_,,English,,
"King of glory, King of peace, I will love Thee","King of glory, King of peace, I will love Thee",_,"Christadelphian Hymn Book: for worship and for witness",CHB2002,98,,,,,,GWALCHMAI,_,,English,,
"Lift up to God the voice of praise, Swell high your grateful song","Lift up to God the voice of praise, Swell high your grateful song",_,"Christadelphian Hymn Book: for worship and for witness",CHB2002,99,,,,,,"BATH C.M.",_,,English,,
"Lord of the circling earth","Lord of the circling earth",_,"Christadelphian Hymn Book: for worship and for witness",CHB2002,100,,,,,,GLANUSK,_,,English,,
"Lord, Thou hast searched and seen us through","Lord, Thou hast searched and seen us through",_,"Christadelphian Hymn Book: for worship and for witness",CHB2002,101,,,,,,"PIERREPONT L.M.",_,,English,,
"My God, how wonderful Thou art","My God, how wonderful Thou art",_,"Christadelphian Hymn Book: for worship and for witness",CHB2002,102,,,,,,"WESTMINSTER C.M.",_,,English,,
"My God, I thank Thee, who has made the earth so bright","My God, I thank Thee, who has made the earth so bright",_,"Christadelphian Hymn Book: for worship and for witness",CHB2002,103,,,,,,APPRECIATION,_,,English,,
"My heart rejoices in the Lord, In the Lord my strength is lifted high","My heart rejoices in the Lord, In the Lord my strength is lifted high",_,"Christadelphian Hymn Book: for worship and for witness",CHB2002,104,,,,,,"HANNAH'S SONG",_,,English,,
"Now thank we all our God With hearts and hands nad voices","Now thank we all our God With hearts and hands nad voices",_,"Christadelphian Hymn Book: for worship and for witness",CHB2002,105,,,,,,"NUN DANKET",_,,English,,