displayTitle,firstLine,textAuthNumber,hymnalTitle,hymnalID,number,textTitle,refrainFirstLine,authors,composers,meter,tuneTitle,tuneAuthNumber,incipit,languages,textSources,tuneSources
"Praise God from Whom All Blessings Flow","Praise God from whom all blessings flow",praise_god_from_whom_all_blessings_ken,"Total Praise: songs and other worship resources for every generation",ToPr2011,637,"Praise God from Whom All Blessings Flow",,"Isaac Watts, 1674-1748; William Kethe, d. 1594; Thomas Ken, 1637-1711","John Hatton, c.1710-1793; George Coles, 1792-1858; Roberta Martin, 1912-1969",,"[Praise God from whom all blessings flow]",praise_god_from_whom_all_blessing_martin,13456717651345543213,English,,
"Praise God from Whom All Blessings Flow","Praise God from whom all blessings flow",praise_god_from_whom_all_blessings_ken,"Lift Every Voice and Sing II: an African American hymnal",LEVS1993,56,"Praise God from Whom All Blessings Flow",,"Isaac Watts (1675-1748); William Keathe (d. 1593); Thomas Ken (1637-1711)","John Hatton (d. 1793); George Coles; Roberta Martin (1912-1969)",,"[Praise God from whom all blessings flow]",praise_god_from_whom_all_blessing_martin,13456717651345543213,English,,
"Praise God, from Whom All Blessings Flow","Praise God, from whom all blessings flow",praise_god_from_whom_all_blessings_ken,"Zion still Sings",ZSS2007,83,"Praise God, from Whom All Blessings Flow",,"Thomas Ken; Isaac Watts; William Kethe","John Hatton; George Coles; Roberta Martin",,"[Praise, God from whom all blessings flow]",praise_god_from_whom_all_blessing_martin,13456717651345543213,English,,
"Praise God From Whom All Blessings Flow","Praise God from whom all blessings flow",praise_god_from_whom_all_blessings_ken,"Songs of Zion",SOZ1981,204,"Praise God From Whom All Blessings Flow",,"Thomas Ken, 1637-1710","Lena McLin, 1928-",,"[Praise God from whom all blessings flow]",praise_god_from_whom_all_blessings_mclin,32216653332216653316,English,,
"Praise God, from Whom All Blessings Flow","Praise God, from whom all blessings flow",praise_god_from_whom_all_blessings_ken,"Zion still Sings",ZSS2007,214,"Praise God, from Whom All Blessings Flow",,"Thomas Ken; Isaac Watts; William Kethe","John Hatton; George Coles; Monya Davis Logan",,"[Praise God, from whom all blessings flow]",duke_street_hatton,134567176555565,English,,
"Praise God, from Whom All Blessings Flow","Praise God, from whom all blessings flow",praise_god_from_whom_all_blessings_ken,"The Worshipbook: Services and Hymns",WSH1972,224,"Praise God, from Whom All Blessings Flow",,"Thomas Ken","David N. Johnson",,"[Praise God, from whom all blessings flow]",praise_god_from_whom_all_bless_johnson,571554345134231,,,
"Praise God From Whom All Blessings Flow","Praise God from whom all blessings flow",praise_god_from_whom_all_blessings_ken,"Songs of Zion",SOZ1981,230,"Praise God From Whom All Blessings Flow",,"Thomas Ken, 1637-1710; Isaac Watts, 1675-1748; William Kethe, d. 1593","John Hatton, d. 1793; George Coles; Roberta Martin, 1912-1969",,"[Praise God from whom all blessings flow]",praise_god_from_whom_all_blessing_martin,13456717651345543213,English,,
"Praise God, from Whom All Blessings Flow!","Praise God, from whom all blessings flow!",praise_god_from_whom_all_blessings_ken,"The Worshipbook: Services and Hymns",WSH1972,244,"Praise God, from Whom All Blessings Flow!",,"Thomas Ken","Joseph Goodman",,"[Praise God, from whom all blessings flow!]",praise_god_from_whom_all_bless_goodman,453234414545676,,,
"Praise God, from Whom All Blessings Flow","Praise God, from whom all blessings flow",praise_god_from_whom_all_blessings_ken,"The Worshipbook: Services and Hymns",WSH1972,266,"Praise God, from Whom All Blessings Flow",,"Thomas Ken","Richard D. Wetzel",,"[Praise God, from whom all blessings flow]",praise_god_from_whom_all_bless_wetzel,116765451156542,,,
"Praise God, from Whom All Blessings Flow","Praise God from whom all blessings flow",praise_god_from_whom_all_blessings_ken,"This Far By Faith: an African American resource for worship",TFBF1999,276,"Praise God, from Whom All Blessings Flow",,"Thomas Ken, 1637-1711; Isaac Watts, 1674-1748; William Kethe, d. 1593","John Hatton, d. 1793; George Coles; Roberta Martin, 1912-1969",,"[Praise God from whom all blessings flow]",praise_god_from_whom_all_blessing_martin,13456717651345543213,English,,
"Praise God from Whom All Blessings Flow","Praise God from whom all blessings flow",praise_god_from_whom_all_blessings_ken,"Lead Me, Guide Me (2nd ed.)",LMGM2012,448,"Praise God from Whom All Blessings Flow",,"Isaac Watts, 1674-1748; William Kethe, d.1593; Thomas Ken, 1637-1711","John Hatton, c.1710-1793; George Coles, b.1792-1858; Roberta Martin, 1912-1969",,"[Praise God from whom all blessings flow]",praise_god_from_whom_all_blessing_martin,13456717651345543213,English,,
"Praise God, from Whom All Blessings Flow","Praise God, from whom all blessings flow",praise_god_from_whom_all_blessings_ken,"Breaking Bread (Vol. 39)",BB2020,540,"Praise God, from Whom All Blessings Flow",,"Thomas Ken, 1637-1711; Isaac Watts, 1674-1748","Louis Bourgeois, ca. 1510-1561",8.8.8.8,"OLD HUNDREDTH",old_hundredth_bourgeois,117651233332143,English,,"<cite>Genevan Psalter</cite>, 1551"
"Praise God, from Whom All Blessings Flow","Praise God, from whom all blessings flow",praise_god_from_whom_all_blessings_ken,"The New National Baptist Hymnal (21st Century Edition)",NNBH2001,559,"Praise God, from Whom All Blessings Flow",,"Thomas Ken; Isaac Watts; William Kethe","Rev. George Coles; Roberta Martin; John Hatton",,"[Praise God, from whom all blessings flow]",praise_god_from_whom_all_blessing_martin,13456717651345543213,English,,"Adapted from John Hatton"
"Praise God from Whom All Blessings","Praise God from whom all blessings flow",praise_god_from_whom_all_blessings_ken,"Hymns for the Living Church",HFLC1974,573,"Praise God from Whom All Blessings",,"Thomas Ken","Richard Avery; Donald Marsh",,"[Praise God from whom all blessings flow]",praise_god_from_whom_all_blessings_avery,532176273321,English,Doxology,
"Praise God from Whom All Blessings Flow","Praise God from whom all blessings flow",praise_god_from_whom_all_blessings_ken,"African American Heritage Hymnal",AAHH2001,650,"Praise God from Whom All Blessings Flow",,"Isaac Watts, 1675-1748; William Keathe, d. 1593; Thomas Ken, 1637-1711","John Hatton, d. 1793; George Coles; Roberta Martin, 1912-1969",,"[Praise God from whom all blessings flow]",praise_god_from_whom_all_blessing_martin,13456717651345543213,English,,
"Praise God, from Whom All Blessings Flow","Praise God, from whom all blessings flow",praise_god_from_whom_all_blessings_ken,"One Lord, One Faith, One Baptism: an African American ecumenical hymnal",OLOF2018,656,"Praise God, from Whom All Blessings Flow",,"Thomas Ken, 1637-1711","John Hatton, c.1710-1793; George Coles, 1792-1858; Roberta Martin, 1912-1969",,"[Praise God, from whom all blessings flow]",praise_god_from_whom_all_blessing_martin,13456717651345543213,English,,
"Praise God, from Whom All Blessings Flow","Praise God from whom all blessings flow",praise_god_from_whom_all_blessings_ken,"Christian Hymnal (Rev. ed.)",CHCH1959,11,"Praise God, from Whom All Blessings Flow",,"Thomas Ken, 1637-1711","Louis bourgeois, c. 1510-c.1561",,"[Praise God from whom all blessings flow]",old_hundredth_bourgeois,117651233332143,English,,"Genevan Psalter 1551"
"Praise God from Whom all Blessings Flow","Praise God from whom all blessings flow",praise_god_from_whom_all_blessings_ken,"The Children Sing: Designed for Children Everywhere, but Primarily Prepared for Use of Children of the Junior Sunday School and Primary Organizations",CS1951a,24,"Praise God from Whom all Blessings Flow",,"Thomas Ken",,,"[Praise God from whom all blessings flow]",old_hundredth_bourgeois,117651233332143,English,,
"Praise God from Whom All Blessings Flow","Praise God from whom all blessings flow",praise_god_from_whom_all_blessings_ken,"Chalice Hymnal",CH1995,46,"Praise God from Whom All Blessings Flow",,"Thomas Ken","Louis Bourgeois",8.8.8.8,"OLD HUNDREDTH (altered rhythm)",old_hundredth_bourgeois,117651233332143,English,,
"Praise God from Whom All Blessings Flow","Praise God from whom all blessings flow",praise_god_from_whom_all_blessings_ken,"Chalice Hymnal",CH1995,47,"Praise God from Whom All Blessings Flow",,"Thomas Ken","Louis Bourgeois",,"OLD HUNDREDTH",old_hundredth_bourgeois,117651233332143,English,,
"Praise God from Whom All Blessings Flow","Praise God from whom all blessings flow",praise_god_from_whom_all_blessings_ken,"Chalice Hymnal",CH1995,48,"Praise God from Whom All Blessings Flow",,"Thomas Ken","Thomas Tallis",8.8.8.8,"TALLIS' CANON",tallis_canon,117112234314433221,English,,
"Praise God, from Whom All Blessings Flow","Praise God, from whom all blessings flow",praise_god_from_whom_all_blessings_ken,"Voices: Native American hymns and worship resources",VOICES92,50,"Praise God, from Whom All Blessings Flow",,"Thomas Ken","Louis Bourgeois",,"[Praise God, from whom all blessings flow]",old_hundredth_bourgeois,117651233332143,English,,
"Praise God from Who All Blessings Flow","Praise God from whom all blessings flow",praise_god_from_whom_all_blessings_ken,"Yes, Lord!: Church of God in Christ hymnal",YL1982,52,"Praise God from Who All Blessings Flow",,"Thomas Ken ; Isaac Watts","John Hatton; Rev. George Coles; Roberta Martin",,"[Praise God from whom all blessings flow]",praise_god_from_whom_all_blessing_martin,13456717651345543213,English,,
"Praise God, From Whom All Blessings Flow","Praise God, from whom all blessings flow",praise_god_from_whom_all_blessings_ken,"Hymnal of Christian Unity",HoCU1964,79,"Praise God, From Whom All Blessings Flow",,"Thomas Ken, 1637-1711; William Kethe, † C. 1599","Louis Bourgeois, C. 1500-1561",,"[Praise God, from whom all blessings flow]",old_hundredth_bourgeois,117651233332143,English,,
"Praise God from Whom","Praise God from whom all blessings flow",praise_god_from_whom_all_blessings_ken,"Renew! Songs and Hymns for Blended Worship",RN1995,83,"Praise God from Whom",,"Thomas Ken","Louis Bourgeois",,"[Praise God from whom all blessings flow] ",old_hundredth_bourgeois,117651233332143,English,"Text A: <i>A Manual of Prayers for the Use of Scholars in Winchester College</i>, 1695; Text B: after Thomas Ken, Rev. <i>Hymns for Today's Church</i>, 1982",
"Praise God, from Whom All Blessings Flow","Praise God, from Whom all blessings flow",praise_god_from_whom_all_blessings_ken,"The Junior Hymnal, Containing Sunday School and Luther League Liturgy and Hymns for the Sunday School",JHCS1928,317,"Praise God, from Whom All Blessings Flow",,"Thomas Ken","Louis Bourgeois",,"[Praise God, from Whom all blessings flow]",old_hundredth_bourgeois,117651233332143,English,,"The Genevan Psalter, 1551"
"Praise God (From Whom All Blessings Flow)","Praise God, from whom all blessings flow",praise_god_from_whom_all_blessings_ken,"The New National Baptist Hymnal",NNBH1977,529,"Praise God (From Whom All Blessings Flow)",,"Thomas Ken","Rev. George Coles; Roberta Martin; John Hatton",,"[Praise God, from whom all blessings flow]",praise_god_from_whom_all_blessing_martin,13456717651345543213,English,"Adapted from Isaac Watts","Adapted from John Hatton"
"Praise God from Whom All Blessings Flow","Praise God from whom all blessings flow",praise_god_from_whom_all_blessings_ken,"Voices United: The Hymn and Worship Book of The United Church of Canada",VU1996,541,"Praise God from Whom All Blessings Flow",,"Thomas Ken",,8.8.8.8,"OLD 100th",old_hundredth_bourgeois,117651233332143,,,"<I>Genevan Psalter</i> 1551"
"Praise God from Whom All Blessings Flow","Praise God from whom all blessings flow",praise_god_from_whom_all_blessings_ken,"Hymns of Faith",HHOF1980,554,"Praise God from Whom All Blessings Flow",,"Thomas Ken",,,"[Praise God from whom all blessings flow]",old_hundredth_bourgeois,117651233332143,English,Doxology,
"Praise God from whom all blessings flow","Praise God, from whom all blessings flow",praise_god_from_whom_all_blessings_ken,"Complete Mission Praise",CMP2000,557,"Praise God from whom all blessings flow",,"Thomas Ken, 1637-1710","Jimmy Owens",,"[Praise God, from whom all blessings flow]",fairhill_owens,5123455654554,English,,
"Praise God, from Whom All Blessings Flow","Praise God, from whom all blessings flow",praise_god_from_whom_all_blessings_ken,"The Presbyterian Hymnal: hymns, psalms, and spiritual songs",PH1990,593,"Praise God, from Whom All Blessings Flow",,"Thomas Ken","Donald S. Marsh; Richard K. Avery",8.8.8.8,DOXOLOGY,praise_god_from_whom_all_blessings_avery,532176273321,English,,
"Praise God, from Whom All Blessings Flow (A Dios, el Padre celestial)","Praise God, from whom all blessings flow (A Dios, el Padre celestial)",praise_god_from_whom_all_blessings_ken,"Santo, Santo, Santo: cantos para el pueblo de Dios = Holy, Holy, Holy: songs for the people of God",SSS2019,696,"Praise God, from Whom All Blessings Flow (A Dios, el Padre celestial)",,"Thomas Ken, 1637-1711; Anonymous; Martin Luther, 1483-1546; Sarah Poulton Kalley; Ambrose, 340-397; J. W. Nordholt","Louis Bourgeois, c.1510-1561",8.8.8.8,"OLD HUNDREDTH",old_hundredth_bourgeois,117651233332143,"Cherokee; Dutch; English; French; German; Japanese; Korean; Mandarin; Mohawk; Navajo; Portuguese; Spanish","Cherokee, tr. traditional; Mohawk tr. traditional",
"Praise God from whom all blessings flow","Praise God from whom all blessings flow",praise_god_from_whom_all_blessings_ken,"The New Century Hymnal",NCH1995,776,,,"Thomas Ken","Ronald A. Nelson",,"[Praise God from whom all blessings flow]",praise_god_from_whom_all_bless_nelson,517654531,,,
"Praise God from whom all blessings flow","Praise God from whom all blessings flow",praise_god_from_whom_all_blessings_ken,"The New Century Hymnal",NCH1995,779,,,"Thomas Ken","John Hatton, d. 1793; George Coles; Roberta Martin",,"[Praise God from whom all blessings flow]",praise_god_from_whom_all_blessing_martin,13456717651345543213,,,
"Praise God, from Whom All Blessings Flow","Praise God from whom all blessings flow (A Deus, supremo benfeitor)(만복의근일하나님)(Oo ne la nuh hiIikidodah)(Bóhólníihii baa dahohniih)(Gott Vater, dem sei ewig Herr)(Gloire à Dieu)(A Dios, el Padre celestial)(Aan God de Vader zij de eer)(たたえよ主の民)(颂赞上主万福之源)",praise_god_from_whom_all_blessings_ken,"Lift Up Your Hearts: psalms, hymns, and spiritual songs",LUYH2013,965,"Praise God, from Whom All Blessings Flow",,"Thomas Ken; Sarah Poulton Kalley; J. W. Nordholt; Martin Luther; Ambrose, 340-397","Louis Bourgeois",8.8.8.8,"GENEVAN 134/OLD HUNDREDTH",old_hundredth_bourgeois,117651233332143,"Cherokee; Dutch; English; French; German; Japanese; Korean; Mandarin; Navajo; Portugese; Spanish","Korean tr. The United Methodist Korean Hymnal Committee; Cherokee tr. traditional; Mohawk tr. traditional",
"Praise God, from Whom All Blessings Flow","Praise God, from whom all blessings flow",praise_god_from_whom_all_blessings_ken,"Songs for Life",SFL,11,"Praise God, from Whom All Blessings Flow",,"Thomas Ken","Louis Bourgeois",8.8.8.8,"OLD HUNDREDTH",old_hundredth_bourgeois,117651233332143,English,,
"Praise God, From Whom All Blessings Flow","Praise God, from whom all blessings flow",praise_god_from_whom_all_blessings_ken,"Hymns to the Living God",HTLG2017,13,"Praise God, From Whom All Blessings Flow",,"Thomas Ken","Louis Bourgeois",8.8.8.8,"OLD HUNDREDTH",old_hundredth_bourgeois,117651233332143,English,,"<cite>Genevan Psalter</cite>, 1551"
"Praise God, from Whom All Blessings Flow","Praise God, from whom all blessings flow",praise_god_from_whom_all_blessings_ken,"The A.M.E. Zion Hymnal: official hymnal of the African Methodist Episcopal Zion Church",AMEZ1996,15,"Praise God, from Whom All Blessings Flow",,"Thomas Ken","Louis Bourgeois",8.8.8.8,"OLD 100th",old_hundredth_bourgeois,117651233332143,English,,
"Praise God from Whom All Blessings Flow","Praise God from whom all blessings flow",praise_god_from_whom_all_blessings_ken,"Hymns of Promise: a large print songbook",HOP2015,16,"Praise God from Whom All Blessings Flow",,"Thomas Ken, 1637-1711","Louis Bourgeois, ca. 1510-1561",8.8.8.8,"OLD HUNDREDTH",old_hundredth_bourgeois,117651233332143,English,<cite>Doxology</cite>,"<cite>Genevan Psalter</cite>, 1551"
"Praise God from Whom All Blessings Flow","Praise God from whom all blessings flow",praise_god_from_whom_all_blessings_ken,"Worship and Rejoice",WAR2003,34,"Praise God from Whom All Blessings Flow",,"Thomas Ken, 1637-1711","Louis Bourgeois, ca. 1510-1561",8.8.8.8,"OLD 100th",old_hundredth_bourgeois,117651233332143,English,<i>Doxology</i>,
"Praise God from whom all blessings flow","Praise God from whom all blessings flow (La gráce de notre Sauveur)",praise_god_from_whom_all_blessings_ken,"The Book of Praise",TBP1997,79,"Praise God from whom all blessings flow",,"Thomas Ken, 1637-1711","Jimmy Owens, 1930-; David Peacock, 1949-",,"COME TOGETHER",fairhill_owens,5123455654554,"English; French",,
"Praise God, from Whom All Blessings Flow","Praise God, from whom all blessings flow",praise_god_from_whom_all_blessings_ken,"The United Methodist Hymnal",UMH,95,"Praise God, from Whom All Blessings Flow",,"Thomas Ken","Louis Bourgeois",8.8.8.8,"OLD 100TH",old_hundredth_bourgeois,117651233332143,English,,
"Praise God, From Whom All Blessings Flow","Praise God, from whom all blessings flow",praise_god_from_whom_all_blessings_ken,"God's Glory",GG1970,99,"Praise God, From Whom All Blessings Flow",,"Thomas Ken","Louis Bourgeois",,"OLD HUNDRED",old_hundredth_bourgeois,117651233332143,,,
"Praise God, From Whom All Blessings Flow","Praise God, from whom all blessings flow",praise_god_from_whom_all_blessings_ken,"The Hymnal for Boys and Girls",H4BG1935,146,"Praise God, From Whom All Blessings Flow",,"Thomas Ken",,8.8.8.8,"OLD HUNDREDTH",old_hundredth_bourgeois,117651233332143,,,"Genevan Psalter"
"Praise God, From Whom All Blessings Flow","Praise God, from whom all blessings flow",praise_god_from_whom_all_blessings_ken,"Psalms and Hymns to the Living God",PHLG2023,156,"Praise God, From Whom All Blessings Flow",,"Thomas Ken","Louis Bourgeois",8.8.8.8,"OLD HUNDREDTH",old_hundredth_bourgeois,117651233332143,English,,
"Praise God, from Whom All Blessings Flow","Praise God, from whom all blessings flow",praise_god_from_whom_all_blessings_ken,"With Heart and Voice: songs for all God's children",WHAV1989,157,"Praise God, from Whom All Blessings Flow",,"Thomas Ken",,8.8.8.8,"NEW DOXOLOGY",new_doxology,,English,,"Traditional Black gospel"
"Praise God, from Whom All Blessings Flow","Praise God, from whom all blessings flow",praise_god_from_whom_all_blessings_ken,"With Heart and Voice: songs for all God's children",WHAV1989,158,"Praise God, from Whom All Blessings Flow",,"Thomas Ken","Louis Bourgeois",8.8.8.8,"GENEVAN 134 (OLD HUNDREDTH)",old_hundredth_bourgeois,117651233332143,English,,
"Praise God from Whom All Blessings Flow","Praise God from whom all blessings flow",praise_god_from_whom_all_blessings_ken,"The Celebration Hymnal: songs and hymns for worship",CEL1997,166,"Praise God from Whom All Blessings Flow",,"Thomas Ken","Ralph Vaughan Williams",,"LASST UNS ERFREUEN",lasst_uns_erfreuen,112313451123134,English,,"<i>Geistliche Kirchengasänge</i>, Cologne, 1623"
"Praise God, From Whom Al Blessings Flow","Praise God, from whom all blessings flow",praise_god_from_whom_all_blessings_ken,"Songs of Life",SoL1921,186,"Praise God, From Whom Al Blessings Flow",,"Thomas Ken",,,"[Praise God, from whom all blessings flow]",old_hundredth_bourgeois,117651233332143,,,"Genevan Psalter"
"Praise God, from Whom All Blessings Flow","Praise God, from whom all blessings flow",praise_god_from_whom_all_blessings_ken,"Hymns of the Church of Jesus Christ of Latter-day Saints",LDS1985,242,"Praise God, from Whom All Blessings Flow",,"Thomas Ken, 1637–1711","Louis Bourgeois, ca. 1510–1561",,"OLD HUNDREDTH",old_hundredth_bourgeois,117651233332143,English,,"From <em>Genfer Psalter</em>, 16th century."
