displayTitle,firstLine,textAuthNumber,hymnalTitle,hymnalID,number,textTitle,refrainFirstLine,authors,composers,meter,tuneTitle,tuneAuthNumber,incipit,languages,textSources,tuneSources
"Tremendous God, with Humble Fear","Tremendous God, with humble fear",tremendous_god_with_humble_fear,"The Cyber Hymnal",CYBER,6896,"Tremendous God, with Humble Fear",,"Charles Wesley","Ralph Harrison, 1748-1810",8.8.8.8,STERLING,sterling_harrison,1111121(2)3333432233,English,"<cite>Preparation for Death</cite>, 1772",
"Tremendous God, with humble fear","Tremendous God, with humble fear",tremendous_god_with_humble_fear,"The Heart and Voice: or, Songs of Praise for the Sanctuary: hymn and tune book, designed for congregational singing in the Methodist Episcopal Church, and for congregations generally",HVSP1865,47b,,,"Charles Wesley, 1707-1788",,,,,,,,
"Tremendous God, with humble fear","Tremendous God, with humble fear",tremendous_god_with_humble_fear,"The Tribute of Praise and Methodist Protestant Hymn Book",TPMP1882,74,,,,,,,,,English,,
"Tremendous God, with humble fear","Tremendous God, with humble fear",tremendous_god_with_humble_fear,"New Hymn and Tune book: an Offering of Praise for the Methodist Episcopal Church",NHTO1866,185b,,,,,,,,,English,,
"Tremendous God, with humble fear","Tremendous God, with humble fear",tremendous_god_with_humble_fear,"Hymn Book of the Holiness Movement Church",HBHM1902,d527,,,"Charles Wesley, 1707-1788",,,,,,English,,
"Tremendous God, with humble fear","Tremendous God, with humble fear",tremendous_god_with_humble_fear,"A Collection of Hymns for the use of the Methodist Episcopal Church. Rev. with a Supplement",CHME1844,d631,,,"Charles Wesley, 1707-1788",,,,,,English,,
"Tremendous God, with humble fear","Tremendous God, with humble fear",tremendous_god_with_humble_fear,"A Collection of Hymns: for the use of the Methodist Episcopal Church, principally from the collection of the Rev. John Wesley, A. M., late fellow of Lincoln College..(Rev. and corr. with a supplement)",CHUM1845,665,,,"Charles Wesley, 1707-1788",,,,,,English,,
"Tremendous God, with humble fear","Tremendous God, with humble fear",tremendous_god_with_humble_fear,"A Collection of Hymns, for the Use of the People Called Methodists, with a Supplement",CHUP1874,717,,,,,8.8.8.8,,,,English,,
"Tremendous God, with humble fear","Tremendous God, with humble fear",tremendous_god_with_humble_fear,"Methodist Hymn and Tune Book",MHTB1894,d818,,,"Charles Wesley, 1707-1788",,,,,,English,,
"Tremendous God, with humble fear","Tremendous God, with humble fear",tremendous_god_with_humble_fear,"The American Hymn and Tune Book",AHTB1860,d829,,,"Charles Wesley, 1707-1788",,,,,,,,
"Tremendous God, with humble fear","Tremendous God, with humble fear",tremendous_god_with_humble_fear,"Methodist Hymn-Book",MHB1884,884,,,"C. Wesley",,8.8.8.8,,,,English,,
"Tremendous God, with humble fear","Tremendous God, with humble fear",tremendous_god_with_humble_fear,"Hymns for the Use of the Methodist Episcopal Church. Rev. ed.",HUME1849,1065,,,,,,,,,English,,
"The inevitable doom","Tremendous God, with humble fear",tremendous_god_with_humble_fear,"The Tribute of Praise: a collection of hymns and tunes for public and social worship, and for use in the family circle",ToP1871,74,"The inevitable doom",,,,,,,,,,
"The inevitable doom","Tremendous God, with humble fear",tremendous_god_with_humble_fear,"The Tribute of Praise: a collection of hymns and tunes for public and social worship, and for the use in the family circle and Sabbath school",ToP1873,74,"The inevitable doom",,,,,,,,,,
"The inevitable doom","Tremendous God, with humble fear",tremendous_god_with_humble_fear,"New Hymn and Tune Book: an Offering of Praise for the Use of the African M. E. Zion Church of America",NHTB1891,185b,"The inevitable doom",,,,8.8.8.8,RELIANCE,reliance_woodbury,3333543223334323,English,,
"The inevitable doom","Tremendous God, with humble fear",tremendous_god_with_humble_fear,"A Collection of Hymns for the use of the African Methodist Episcopal Zion Church in America",ACOH1872,1065,"The inevitable doom",,,,8.8.8.8,,,,English,,
