displayTitle,firstLine,textAuthNumber,hymnalTitle,hymnalID,number,textTitle,refrainFirstLine,authors,composers,meter,tuneTitle,tuneAuthNumber,incipit,languages,textSources,tuneSources
"How Deep The Father's Love For Us","How deep the Father's love for us",how_deep_the_fathers_love_for_us,"CCLI Top 100 ",CCLI2017,22,"How Deep The Father's Love For Us",,"Stuart Townend","Stuart Townend",,"[How deep the Father's love for us]",how_deep_the_fathers_love_for_us_townend,331232165511332,English,,
"How Deep The Father's Love For Us","How deep the Father's love for us",how_deep_the_fathers_love_for_us,"CCLI Top 100",CCLI2016,25,"How Deep The Father's Love For Us",,"Stuart Townend","Stuart Townend",,"[How deep the Father's love for us]",how_deep_the_fathers_love_for_us_townend,331232165511332,English,,
"How Deep The Father's Love For Us","How deep the Father's love for us",how_deep_the_fathers_love_for_us,"CCLI Top 100",CCLI2019,26,"How Deep The Father's Love For Us",,"Stuart Townend","Stuart Townend",,"[How deep the Father's love for us]",how_deep_the_fathers_love_for_us_townend,331232165511332,English,,
"How Deep The Father's Love For Us","How deep the Father's love for us",how_deep_the_fathers_love_for_us,"CCLI Top 100",CCLI2022,27,"How Deep The Father's Love For Us",,"Stuart Townend","Stuart Townend",,"[How deep the Father's love for us]",how_deep_the_fathers_love_for_us_townend,331232165511332,English,,
"How Deep The Father's Love For Us","How deep the Father's love for us",how_deep_the_fathers_love_for_us,"CCLI Top 100",CCLI2018,28,"How Deep The Father's Love For Us",,"Stuart Townend","Stuart Townend",,"[How deep the Father's love for us]",how_deep_the_fathers_love_for_us_townend,331232165511332,English,,
"How Deep The Father's Love For Us","How deep the Father's love for us",how_deep_the_fathers_love_for_us,"CCLI Top 100 ",CCLI2021,31,"How Deep The Father's Love For Us",,"Stuart Townend","Stuart Townend",,"[How deep the Father's love for us]",how_deep_the_fathers_love_for_us_townend,331232165511332,English,,
"How Deep The Father's Love For Us","How deep the Father's love for us",how_deep_the_fathers_love_for_us,"CCLI Top 100",CCLI2020,35,"How Deep The Father's Love For Us",,"Stuart Townend","Stuart Townend",,"[How deep the Father's love for us]",how_deep_the_fathers_love_for_us_townend,331232165511332,English,,
"How Deep the Father's Love for Us","How deep the Father's love for us",how_deep_the_fathers_love_for_us,"The Minter Lane Hymnal VI",MLH2013,46,"How Deep the Father's Love for Us",,"Stuart Townend","Stuart Townend",,"[How deep the Father's love for us]",how_deep_the_fathers_love_for_us_townend,331232165511332,English,,
"How Deep The Father's Love For Us","How deep the Father's love for us",how_deep_the_fathers_love_for_us,"CCLI Top 100",CCLI2023,46,"How Deep The Father's Love For Us",,"Stuart Townend","Stuart Townend",,"[How deep the Father's love for us]",how_deep_the_fathers_love_for_us_townend,331232165511332,English,,
"How Deep the Father's Love for Us","How deep the Father's love for us",how_deep_the_fathers_love_for_us,"Rejoice Hymns",RH2011,106,"How Deep the Father's Love for Us","How high, how wide, how pure","Stuart Townend, 1963-","Stuart Townend, 1963-",Irregular,"FATHER'S LOVE",how_deep_the_fathers_love_for_us_townend,331232165511332,English,,
"How deep the Father's love for us","How deep the Father's love for us",how_deep_the_fathers_love_for_us,"Complete Mission Praise",CMP2000,988,"How deep the Father's love for us",,"Stuart Townend","Stuart Townend",,"[How deep the Father's love for us]",how_deep_the_fathers_love_for_us_townend,331232165511332,English,,
"How Deep the Father's Love for Us","How deep the Father's love for us, how vast beyond all measure",how_deep_the_fathers_love_for_us,"Baptist Hymnal 2008",BH2008,101,"How Deep the Father's Love for Us",,"Stuart Townend","Stuart Townend; Bruce Greer",Irregular,TOWNEND,how_deep_the_fathers_love_for_us_townend,331232165511332,English,,
"How deep the Father's love for us","How deep the Father's love for us",how_deep_the_fathers_love_for_us,"Ancient and Modern: hymns and songs for refreshing worship",AM2013,144,,,"Stuart Townend (b. 1963)","Stuart Townend (b. 1963)",,"[How deep the Father's love for us]",how_deep_the_fathers_love_for_us_townend,331232165511332,English,,
"How Deep the Father's Love for Us","How deep the Father's love for us",how_deep_the_fathers_love_for_us,"Celebrating Grace Hymnal",CGH2010,178,"How Deep the Father's Love for Us",,"Stuart Townend","Stuart Townend","8.7.8.7 D",TOWNEND,how_deep_the_fathers_love_for_us_townend,331232165511332,English,,
"How Deep the Father’s Love for Us","How deep the Father's love for us",how_deep_the_fathers_love_for_us,"One and All Rejoice",OAR2020,203,"How Deep the Father’s Love for Us",,"Stuart Townend, b. 1963","Stuart Townend, b. 1963; Bruce Greer, b. 1961","8.7.8.7 D",TOWNEND,how_deep_the_fathers_love_for_us_townend,331232165511332,English,,
"How Deep the Father's Love for Us","How deep the Father's love for us",how_deep_the_fathers_love_for_us,"Psalms and Hymns to the Living God",PHLG2023,340,"How Deep the Father's Love for Us",,"Stuart Townend","Stuart Townend",,TOWNEND,how_deep_the_fathers_love_for_us_townend,331232165511332,English,,
"How Deep the Father's Love for Us","How deep the Father's love for us",how_deep_the_fathers_love_for_us,"Trinity Psalter Hymnal",TPH2018,351,"How Deep the Father's Love for Us",,"Stuart Townend","Stuart Townend","8.7.8.7 D",TOWNEND,how_deep_the_fathers_love_for_us_townend,331232165511332,English,,
"How deep the Father's love for us","How deep the Father's love for us",how_deep_the_fathers_love_for_us,"The Irish Presbyterian Hymnbook",IPH2004,407a,,,"Stuart Townend, b. 1963","Stuart Townend, b. 1963","8.7.8.7 D","HOW DEEP THE FATHER'S LOVE",how_deep_the_fathers_love_for_us_townend,331232165511332,English,,
"How deep the Father's love for us","How deep the Father's love for us",how_deep_the_fathers_love_for_us,"The Irish Presbyterian Hymnbook",IPH2004,407b,,,"Stuart Townend, b. 1963","Stuart Townend, b. 1963; Donald Davison, b. 1937","8.7.8.7 D","HOW DEEP THE FATHER'S LOVE",how_deep_the_fathers_love_for_us_townend,331232165511332,English,,
"How Deep the Father's Love for Us","How deep the Father's love for us",how_deep_the_fathers_love_for_us,"Christian Worship: Hymnal",CWH2021,523,"How Deep the Father's Love for Us",,"Stuart Townend, b. 1963","Stuart Townend, b. 1963; Bruce Greer, b. 1961","8.7.8.7 D",TOWNEND,how_deep_the_fathers_love_for_us_townend,331232165511332,English,,
"How deep the Father's love for us","How deep the Father's love for us",how_deep_the_fathers_love_for_us,"Church Hymnary (4th ed.)",CH4,549,,,"Stuart Townend","Stuart Townend","8.7.8.7 D","HOW DEEP THE FATHER'S LOVE",how_deep_the_fathers_love_for_us_townend,331232165511332,English,,
"How deep the Father's love for us","How deep the Father's love for us",how_deep_the_fathers_love_for_us,"Hymns of Glory, Songs of Praise",HGSP2008,549,,,"Stuart Townend","Stuart Townend","8.7.8.7 D","HOW DEEP THE FATHER'S LOVE",how_deep_the_fathers_love_for_us_townend,331232165511332,English,,
"How deep the Father's love for us","How deep the Father's love for us",how_deep_the_fathers_love_for_us,"Anglican Hymns Old and New (Rev. and Enl.)",HON2008,317,,,"Stuart Townend","Stuart Townend",,"[How deep the Father's love for us]",how_deep_the_fathers_love_for_us_townend,331232165511332,English,,
"How deep the Father's love for us","How deep the Father's love for us",how_deep_the_fathers_love_for_us,"The Christian Life Hymnal",CLH2006,157,,,,,,"FATHER'S LOVE",how_deep_the_fathers_love_for_us_townend,331232165511332,,,
"How Deep the Father's Love for Us","How deep the Father's love for us",how_deep_the_fathers_love_for_us,"Praise y Adoración: a bilingual hymnal : un himnario bilingüe",PyA2016,286a,"How Deep the Father's Love for Us",,"Stuart Townend, b. 1963",,,,,,English,,
"How Deep the Father's Love for Us","[How Deep the Father's Love for Us]",how_deep_the_fathers_love_for_us,"Scripture Song Database",NTSONG,1522,"How Deep the Father's Love for Us",,"Stuart Townend",,,,,,English,"<i>Worship Together Songbook 1.0</i> (Worship Together, 1995)",
"How deep the Father’s love for us","How deep the Father’s love for us",how_deep_the_fathers_love_for_us,"Sing Glory: Hymns, Psalms and Songs for a New Century",SingGlor,193,,,,,Irregular,,,,,,
"How deep the Father’s love for us","How deep the Father’s love for us",how_deep_the_fathers_love_for_us,"Church Hymnal, Fifth Edition",ICH5,224,,,,,,,,,,,
