displayTitle,firstLine,textAuthNumber,hymnalTitle,hymnalID,number,textTitle,refrainFirstLine,authors,composers,meter,tuneTitle,tuneAuthNumber,incipit,languages,textSources,tuneSources
"Praise God, from whom all blessings flow","Praise God, from whom all blessings flow",praise_god_from_whom_all_blessings_ken,"The Book of Worship",BW1867,D1,,,,,8.8.8.8,,,,English,,
"Now let the Father and the Son","Now let the Father and the Son",now_let_the_father_and_the_son,"The Book of Worship",BW1867,D2,,,,,8.6.8.6,,,,English,,
"Ye angels round the throne","Ye angels round the throne",ye_angels_round_the_throne,"The Book of Worship",BW1867,D3,,,,,6.6.8.6,,,,English,,
"Sing we to our God above","Sing we to our God above",sing_we_to_our_god_above,"The Book of Worship",BW1867,D4,,,,,,,,,English,,
"Great Jehovah! we adore Thee","Great Jehovah! we adore Thee",great_jehovah_we_adore_thee,"The Book of Worship",BW1867,D5,,,,,,,,,English,,
"To Father, Son, and Holy Ghost","To Father, Son, and Holy Ghost",to_father_son_and_holy_ghost_while_ang,"The Book of Worship",BW1867,D6,,,,,,,,,English,,
"Praise the God of our salvation","Praise the God of our salvation",praise_the_god_of_all_creation_praise_th,"The Book of Worship",BW1867,D7,,,,,,,,,English,,
"All praise to the Father, the Son","All praise to the Father, the Son",all_praise_to_the_father_the_son,"The Book of Worship",BW1867,D8,,,,,,,,,English,,
"All ye who grace inherit","All ye who grace inherit",all_ye_who_grace_inherit,"The Book of Worship",BW1867,D9,,,,,,,,,English,,
"To God the Father's throne","To God the Father's throne",to_god_the_fathers_throne_watts_2,"The Book of Worship",BW1867,D10,,,,,,,,,English,,
"Now to the great and sacred Three","Now to the great and sacred Three",now_to_the_great_and_sacred_three,"The Book of Worship",BW1867,D11,,,,,,,,,English,,
"To Father, Son, and Holy Ghost","To Father, Son, and Holy Ghost",to_father_son_and_holy_ghost_thgodheatri,"The Book of Worship",BW1867,D12,,,,,,,,,English,,
"O Father Almighty, to Thee be addressed","O Father Almighty, to Thee be addressed",o_father_almighty_to_thee_be_addressed,"The Book of Worship",BW1867,D13,,,,,11.11.11.11,,,,English,,
"Old Hundred","Before Jehovah's awful throne",before_jehovahs_awful_throne,"The Book of Worship",BW1867,1,"Old Hundred",,,,,,,,English,,
"Oh 'twas a joyful sound to hear","Oh 'twas a joyful sound to hear",o_twas_a_joyful_sound_to_hear_our_tribes,"The Book of Worship",BW1867,2,,,,,8.6.8.6,,,,English,,
"Oh with due reverence let us all","Oh with due reverence let us all",o_with_due_reverence_let_us_all,"The Book of Worship",BW1867,3,,,,,8.6.8.6,,,,English,,
"How pleasant, how divinely fair","How pleasant, how divinely fair",how_pleasant_how_divinely_fair,"The Book of Worship",BW1867,4,,,,,8.8.8.8,,,,English,,
"Humble Request","Lord, we come before Thee now",lord_we_come_before_thee_now,"The Book of Worship",BW1867,5,"Humble Request",,,,,,,,English,,
"God is in this Place","Lo, God is here! let us adore",lo_god_is_here_let_us_adore,"The Book of Worship",BW1867,6,"God is in this Place",,,,,,,,English,,
"Early, my God, without delay","Early, my God, without delay",early_my_god_without_delay,"The Book of Worship",BW1867,7,,,,,8.6.8.6,,,,English,,
"The Sabbath preparatory to Heaven","Lord of the Sabbath! hear our vows",lord_of_the_sabbath_hear_our_vows,"The Book of Worship",BW1867,8,"The Sabbath preparatory to Heaven",,,,8.8.8.8,,,,English,,
"With one consent let all the earth","With one consent let all the earth",with_one_consent_let_all_the_earth,"The Book of Worship",BW1867,9,,,,,8.8.8.8,,,,English,,
"Be joyful in God, all ye lands of the earth","Be joyful in God, all ye lands of the earth",be_joyful_in_god_all_ye_lands_of_the_ear,"The Book of Worship",BW1867,10,,,,,,,,,English,,
Sabbath,"Safely through another week",safely_through_another_week,"The Book of Worship",BW1867,11,Sabbath,,,,,,,,English,,
"Delight in Ordinances","Welcome, sweet day of rest",welcome_sweet_day_of_rest_that_saw_the,"The Book of Worship",BW1867,12,"Delight in Ordinances",,,,6.6.8.6,,,,English,,
"Far from mortal cares retreating","Far from mortal cares retreating",far_from_mortal_cares_retreating,"The Book of Worship",BW1867,13,,,,,,,,,English,,
"The Thrice Holy One","Holy, holy, holy, Lord",holy_holy_holy_lord_god_of_hosts_when_he,"The Book of Worship",BW1867,14,"The Thrice Holy One",,,,,,,,English,,
"Father of all! whose love profound","Father of all! whose love profound",father_of_heaven_whose_love_profound,"The Book of Worship",BW1867,15,,,,,8.8.8.8,,,,English,,
"Trinity Sunday","O holy, holy, holy, Lord!",o_holy_holy_holy_lord_bright_in_thy_deed,"The Book of Worship",BW1867,16,"Trinity Sunday",,,,8.8.8.8,,,,English,,
"God Eternal and Unchangeable","Great God, how infinite art Thou!",great_god_how_infinite_art_thou_what,"The Book of Worship",BW1867,17,"God Eternal and Unchangeable",,,,8.6.8.6,,,,English,,
"God is a Spirit, just and wise","God is a Spirit, just and wise",god_is_a_spirit_just_and_wise_he_sees,"The Book of Worship",BW1867,18,,,,,8.6.8.6,,,,English,,
"The Eternal and Sovereign God","Jehovah reigns; He dwells in light",jehovah_reigns_he_dwells_in_light,"The Book of Worship",BW1867,19,"The Eternal and Sovereign God",,,,8.8.8.8,,,,English,,
"God exalted above all Praise","Parent of good! Thy works of might",parent_of_good_thy_works_of_might,"The Book of Worship",BW1867,20,"God exalted above all Praise",,,,,,,,English,,
"Father, how wide Thy glory shines!","Father, how wide Thy glory shines!",father_how_wide_thy_glory_shines,"The Book of Worship",BW1867,21,,,,,8.6.8.6,,,,English,,
"Lord, all I am is known to Thee!","Lord, all I am is known to Thee!",lord_all_i_am_is_known_to_thee,"The Book of Worship",BW1867,22,,,,,8.6.8.6,,,,English,,
"Holy and reverend is the name","Holy and reverend is the name",holy_and_reverend_is_the_name,"The Book of Worship",BW1867,23,,,,,8.6.8.6,,,,English,,
"Thy ceaseless, unexhausted love","Thy ceaseless, unexhausted love",thy_ceaseless_unexhausted_love,"The Book of Worship",BW1867,24,,,,,8.6.8.6,,,,English,,
"My soul, repeat His praise","My soul, repeat His praise",my_soul_repeat_his_praise,"The Book of Worship",BW1867,25,,,,,6.6.8.6,,,,English,,
"Oh bless the Lord, my soul!","Oh bless the Lord, my soul!",o_bless_the_lord_my_soul_let_all_within,"The Book of Worship",BW1867,26,,,,,6.6.8.6,,,,English,,
"Divine Goodness a Ground of Trust","Give to the winds Thy fears",give_to_the_winds_thy_fears,"The Book of Worship",BW1867,27,"Divine Goodness a Ground of Trust",,,,6.6.8.6,,,,English,,
"""God Calling Yet""","God calling yet! - shall I not hear?",god_calling_yet_shall_i_not_hear,"The Book of Worship",BW1867,28,"""God Calling Yet""",,,,,,,,English,,
"How firm a foundation, ye saints of the Lord","How firm a foundation, ye saints of the Lord",how_firm_a_foundation_ye_saints_of,"The Book of Worship",BW1867,29,,,,,,,,,English,,
"The Lord my pasture shall prepare","The Lord my pasture shall prepare",the_lord_my_pasture_shall_prepare_and_fe,"The Book of Worship",BW1867,30,,,,,8.8.8.8,,,,English,,
"To Sion's hill I lift my eyes","To Sion's hill I lift my eyes",to_zions_hill_i_lift_my_eyes_tatebrady,"The Book of Worship",BW1867,31,,,,,8.6.8.6,,,,English,,
"Though troubles assail, and dangers affright","Though troubles assail, and dangers affright",though_troubles_assail_and_dangers_affri,"The Book of Worship",BW1867,32,,,,,,,,,English,,
"God is the refuge of His saints","God is the refuge of His saints",god_is_the_refuge_of_his_saints_when_sto,"The Book of Worship",BW1867,33,,,,,8.8.8.8,,,,English,,
"O God! our help in ages past","O God! our help in ages past",our_god_our_help_in_ages_past_watts,"The Book of Worship",BW1867,34,,,,,8.6.8.6,,,,English,,
"The Seasons Ordered by God","Great God, at whose all-powerful call",great_god_at_whose_allpowerful_call,"The Book of Worship",BW1867,35,"The Seasons Ordered by God",,,,8.8.8.8,,,,English,,
"Soveriegn Ruler of the skies","Soveriegn Ruler of the skies",sovereign_ruler_of_the_skies,"The Book of Worship",BW1867,36,,,,,,,,,English,,
"Dark Providence","Thy way, O God, is in the sea",thy_way_o_god_is_in_the_sea,"The Book of Worship",BW1867,37,"Dark Providence",,,,8.6.8.6,,,,English,,
